{"text_format":"1","workbook":"xlsx","n_sheets":29,"sheets":["Alert","General Info","Evaluation","1. Mandatory Conditions","2. Lighting","3. Entry Exit","4. Parking Area","5. Ramps","6. Pedestrian Access","7. Security equipment","8. Wayfinding","9. Comfort","10. Energy Environment","Minus","Bonus","Gold Award","Languages","Options","Tags","Help","Languages Available","Aux","Translations","Languages (2)","Options (2)","Tags (2)","Welcome Sheet","Translation Sheet","Unplugged Translation Sheet"],"not_rendered":{"charts":0,"images":1,"macros":1,"external_links":0,"defined_names":40,"comments":0,"pivot_tables":0},"unopened":[],"bounds":{"document_bytes":16777216,"sheet_cells":100000,"rows_first":2000,"rows_last":500,"rows_between":2000,"halvings":0,"cell_chars":16384,"cell_head_chars":4096},"cells_cut":0,"cells_raw":0,"read":"whole","date_system":"1900"}

{"sheet":"Alert","index":0,"n_rows":1,"n_cols":1,"rows_kept":1,"cut":false,"hidden":false,"merged":[[0,0,23,10]]}
[{"$f":"Tags!B72","v":"The ESPA Worksheet uses Macros. Please enable content or close and reopen with Macros Enabled"}]

{"sheet":"General Info","index":1,"n_rows":41,"n_cols":5,"rows_kept":41,"cut":false,"hidden":false,"merged":[[40,3,40,4],[34,3,34,4],[28,3,28,4],[38,3,38,4],[36,3,36,4],[32,3,32,4],[30,3,30,4],[26,1,26,4],[8,2,8,4],[23,2,23,4],[10,2,10,4],[12,2,12,4],[13,2,13,4],[17,2,17,4],[19,2,19,4],[15,2,15,4]]}
[]
[null,null,null,{"$f":"Tags!B4","v":"Date"},"2016-09-08"]
[null,null,null,{"$f":"Tags!B5","v":"Language"},"English"]
[null,null,null,{"$f":"Tags!B6","v":"Country"}]
[]
[]
[]
[]
[null,null,"EUROPEAN STANDARD PARKING AWARD"]
[]
[null,{"$f":"Tags!B7","v":"Name of Car Park"}]
[]
[null,{"$f":"Tags!B8","v":"Address"}]
[]
[]
[null,{"$f":"Tags!B9","v":"City"}]
[]
[null,{"$f":"Tags!B11","v":"Operator"}]
[]
[null,{"$f":"Tags!B12","v":"Contact Name"}]
[]
[null,{"$f":"Tags!B13","v":"e-Mail"},null,{"$f":"Tags!B14","v":"Phone"}]
[]
[null,{"$f":"Tags!B15","v":"Judged by"}]
[]
[]
[null,{"$f":"Tags!B79","v":"Car Park Main Characteristics"}]
[]
[null,{"$f":"Tags!B73","v":"Year of Construction"}]
[]
[null,{"$f":"Tags!B10","v":"Number of Spaces"}]
[]
[null,{"$f":"Tags!B78","v":"Number of Floors"}]
[]
[null,{"$f":"Tags!B77","v":"Number of Lifts"}]
[]
[null,{"$f":"Tags!B74","v":"Structure"}]
[]
[null,{"$f":"Tags!B75","v":"Type"}]
[]
[null,{"$f":"Tags!B76","v":"Access Control System"}]

{"sheet":"Evaluation","index":2,"n_rows":27,"n_cols":13,"rows_kept":27,"cut":false,"hidden":false,"merged":[[23,10,25,12],[26,10,28,12],[2,0,2,1],[5,0,5,1],[23,5,25,8],[23,9,25,9],[26,5,28,8],[26,9,28,9],[15,0,15,1],[19,0,19,1],[26,0,28,3],[26,4,28,4],[23,0,25,3],[23,4,25,4],[21,0,21,1]]}
[{"$f":"Tags!B38","v":"Global Evaluation"},null,{"$f":"'General Info'!C11","v":0},null,null,null,null,null,null,null,null,{"$f":"Tags!B49","v":"% Completion:"},{"$f":"E22/D22","v":0}]
[]
[{"$f":"Tags!B39","v":"Category"},null,{"$f":"Tags!B40","v":"Number of Items"},{"$f":"Tags!B41","v":"Number of Oks"},{"$f":"Tags!B42","v":"Number of Fails"},{"$f":"Tags!B43","v":"To be Completed"},null,null,null,null,null,null,{"$f":"M6","v":"Status"}]
[1,{"$f":"'1. Mandatory Conditions'!B1","v":"Mandatory Minimum Conditions"},{"$f":"'1. Mandatory Conditions'!C16+'1. Mandatory Conditions'!C17+'1. Mandatory Conditions'!C18","v":11},{"$f":"'1. Mandatory Conditions'!C16","v":0},{"$f":"C4-D4","v":11},{"$f":"'1. Mandatory Conditions'!C18","v":11},null,null,null,null,null,null,{"$f":"IF(E4>0,fail,IF(F4=0,pass,incomplete))","v":"Fail"}]
[]
[{"$f":"A3","v":"Category"},null,{"$f":"Tags!B30","v":"Total Items"},{"$f":"Tags!B31","v":"Total Items + SubItems"},{"$f":"Tags!B32","v":"Itens Completed"},{"$f":"Tags!B33","v":"Not measured"},{"$f":"Tags!B35","v":"Maximum Score"},{"$f":"Tags!B34","v":"Score"},{"$f":"Tags!B44","v":"% Obtained"},{"$f":"Tags!B45","v":"Minimum"},{"$f":"Tags!B46","v":"Category Points"},{"$f":"Tags!B47","v":"Points Obtained"},{"$f":"Tags!B48","v":"Status"}]
[{"$f":"'2. Lighting'!$A$1","v":2},{"$f":"'2. Lighting'!$B$1","v":"Lighting"},{"$f":"'2. Lighting'!$C$3","v":8},{"$f":"'2. Lighting'!$C$4","v":17},{"$f":"'2. Lighting'!$C$5","v":0},{"$f":"'2. Lighting'!$C$6","v":17},{"$f":"'2. Lighting'!$F$4","v":46},{"$f":"'2. Lighting'!$F$3","v":0},{"$f":"+H7/G7","v":0},0.4,16,{"$f":"I7*K7","v":0},{"$f":"IF(I7>=J7,pass,IF(F7=0,fail,incomplete))","v":"Incomplete"}]
[{"$f":"'3. Entry Exit'!$A$1","v":3},{"$f":"'3. Entry Exit'!$B$1","v":"Car Entry / Car Exit"},{"$f":"'3. Entry Exit'!$C$3","v":11},{"$f":"'3. Entry Exit'!$C$4","v":23},{"$f":"'3. Entry Exit'!$C$5","v":0},{"$f":"'3. Entry Exit'!$C$6","v":23},{"$f":"'3. Entry Exit'!$F$4","v":29},{"$f":"'3. Entry Exit'!$F$3","v":0},{"$f":"+H8/G8","v":0},0.4,8,0,"Incomplete"]
[{"$f":"'4. Parking Area'!$A$1","v":4},{"$f":"'4. Parking Area'!$B$1","v":"Parking Area"},{"$f":"'4. Parking Area'!$C$3","v":10},{"$f":"'4. Parking Area'!$C$4","v":22},{"$f":"'4. Parking Area'!$C$5","v":0},{"$f":"'4. Parking Area'!$C$6","v":22},{"$f":"'4. Parking Area'!$F$4","v":43},{"$f":"'4. Parking Area'!$F$3","v":0},0,0.4,20,0,"Incomplete"]
[{"$f":"'5. Ramps'!$A$1","v":5},{"$f":"'5. Ramps'!$B$1","v":"Vehicle Ramps"},{"$f":"'5. Ramps'!$C$3","v":7},{"$f":"'5. Ramps'!$C$4","v":7},{"$f":"'5. Ramps'!$C$5","v":0},{"$f":"'5. Ramps'!$C$6","v":7},{"$f":"'5. Ramps'!$F$4","v":13},{"$f":"'5. Ramps'!$F$3","v":0},0,0.4,8,0,"Incomplete"]
[{"$f":"'6. Pedestrian Access'!$A$1","v":6},{"$f":"'6. Pedestrian Access'!$B$1","v":"Pedestrian Access"},{"$f":"'6. Pedestrian Access'!$C$3","v":13},{"$f":"'6. Pedestrian Access'!$C$4","v":23},{"$f":"'6. Pedestrian Access'!$C$5","v":0},{"$f":"'6. Pedestrian Access'!$C$6","v":23},{"$f":"'6. Pedestrian Access'!$F$4","v":43},{"$f":"'6. Pedestrian Access'!$F$3","v":0},0,0.4,16,0,"Incomplete"]
[7,{"$f":"'7. Security equipment'!$B$1","v":"Security Equipment"},{"$f":"'7. Security equipment'!$C$3","v":8},{"$f":"'7. Security equipment'!$C$4","v":16},{"$f":"'7. Security equipment'!$C$5","v":0},{"$f":"'7. Security equipment'!$C$6","v":16},{"$f":"'7. Security equipment'!$F$4","v":35},{"$f":"'7. Security equipment'!$F$3","v":0},0,0.4,8,0,"Incomplete"]
[8,{"$f":"'8. Wayfinding'!$B$1","v":"Wayfinding Inside and Outside"},{"$f":"'8. Wayfinding'!$C$3","v":11},{"$f":"'8. Wayfinding'!$C$4","v":18},{"$f":"'8. Wayfinding'!$C$5","v":0},{"$f":"'8. Wayfinding'!$C$6","v":18},{"$f":"'8. Wayfinding'!$F$4","v":31},{"$f":"'8. Wayfinding'!$F$3","v":0},0,0.4,8,0,"Incomplete"]
[9,{"$f":"'9. Comfort'!$B$1","v":"Comfort and Miscellaneous"},{"$f":"'9. Comfort'!$C$3","v":10},{"$f":"'9. Comfort'!$C$4","v":27},{"$f":"'9. Comfort'!$C$5","v":0},{"$f":"'9. Comfort'!$C$6","v":27},{"$f":"'9. Comfort'!$F$4","v":34},{"$f":"'9. Comfort'!$F$3","v":0},0,0.3,8,0,"Incomplete"]
[10,{"$f":"'10. Energy Environment'!$B$1","v":"Energy and Environment"},{"$f":"'10. Energy Environment'!$C$3","v":10},{"$f":"'10. Energy Environment'!$C$4","v":11},{"$f":"'10. Energy Environment'!$C$5","v":0},{"$f":"'10. Energy Environment'!$C$6","v":11},{"$f":"'10. Energy Environment'!$F$4","v":20},{"$f":"'10. Energy Environment'!$F$3","v":0},0,0.15,8,0,"Incomplete"]
[{"$f":"Tags!B50","v":"Subtotals"},null,{"$f":"SUM(C7:C15)","v":88},164,0,164,294,0,null,null,{"$f":"SUM(K7:K15)","v":100},{"$f":"SUM(L7:L15)","v":0}]
[]
[{"$f":"Minus!$A$1","v":"M"},{"$f":"Minus!$B$1","v":"Minus Points"},{"$f":"Minus!$C$3","v":8},{"$f":"Minus!$C$4","v":23},{"$f":"Minus!$C$5","v":0},{"$f":"Minus!$C$6","v":23},{"$f":"Minus!F4","v":-60},{"$f":"Minus!F3","v":0},{"$f":"H18/G18","v":0},null,-15,{"$f":"K18*I18","v":0}]
[{"$f":"Bonus!$A$1","v":"B"},{"$f":"Bonus!$B$1","v":"Bonus Points"},{"$f":"Bonus!$C$3","v":7},{"$f":"Bonus!$C$4","v":16},{"$f":"Bonus!$C$5","v":0},{"$f":"Bonus!$C$6","v":16},{"$f":"Bonus!F4","v":33},{"$f":"Bonus!F3","v":0},{"$f":"H19/G19","v":0},null,15,{"$f":"I19*K19","v":0}]
[{"$f":"A16","v":"Subtotals"},null,{"$f":"SUM(C18:C19)","v":15},{"$f":"SUM(D18:D19)","v":39},0,39,-27,0,null,null,{"$f":"SUM(K18:K19)","v":0},{"$f":"SUM(L18:L19)","v":0}]
[]
[{"$f":"Tags!B51","v":"Totals"},null,{"$f":"C20+C16","v":103},203,0,203,267,0,null,null,{"$f":"K16+K20","v":100},{"$f":"L16+L20","v":0}]
[]
[{"$f":"UPPER(Tags!B52)","v":"MINIMUM REQUIREMENT FOR ESPA AWARD"},null,null,null,0.5,{"$f":"UPPER(B4)","v":"MANDATORY MINIMUM CONDITIONS"},null,null,null,{"$f":"IF(M4=pass,\"OK\",IF(M4=fail,\"KO\",\"-\"))","v":"KO"},{"$f":"UPPER(Tags!B54)","v":"ESPA AWARD"}]
[]
[]
[{"$f":"UPPER(Tags!B44)","v":"% OBTAINED"},null,null,null,{"$f":"L22/K22","v":0},{"$f":"UPPER(Tags!B53)","v":"CATEGORIES MINIMUM POINTS"},null,null,null,{"$f":"IF(COUNTIF(M7:M15,pass)<9,\"KO\",\"OK\")","v":"KO"},{"$f":"UPPER(IF(AND(E27>=E24,J24=\"OK\",J27=\"OK\"),yes,IF(OR(E27<E24,J24=\"KO\",J27=\"KO\"),no,\"NA\")))","v":"NO"}]

{"sheet":"1. Mandatory Conditions","index":3,"n_rows":19,"n_cols":5,"rows_kept":19,"cut":false,"hidden":false,"merged":[[12,3,12,4],[15,4,17,4],[2,3,2,4],[3,3,3,4],[4,3,4,4],[5,3,5,4],[6,3,6,4],[7,3,7,4],[8,3,8,4],[9,3,9,4],[10,3,10,4],[11,3,11,4],[13,3,13,4]]}
[1,{"$f":"Languages!B4","v":"Mandatory Minimum Conditions"},null,null,{"$f":"IF(C18>0,Tags!B21,Tags!B20)","v":"Incompleted"}]
[]
[null,null,{"$f":"Tags!B22","v":"Compliant"},{"$f":"Tags!B23","v":"Comments"}]
["1.1",{"$f":"Languages!B5","v":"Car park must be for public use"}]
["1.2",{"$f":"Languages!B6","v":"Minimum headroom = 1.90 m, generally in the public areas. Incidental lower obstacles must be clearly marked."}]
["1.3",{"$f":"Languages!B8","v":"There must be at least one dedicated entry and exit lane although additional tidal flow lanes are allowed."}]
["1.4",{"$f":"Languages!B9","v":"70% of bays must be at least 2.30m wide. For renovated car parks, over ten years old, minimum bay width of 2.25m is allowed (in that case a penalty applies - check M8)."}]
["1.5",{"$f":"Languages!B11","v":"All straight ramps for  unidirectional traffic must be minimum 2.7 metres wide. Bidirectional ramps must be at least 6m wide with lane markings. Ramp width is measured between walls or pillars"}]
["1.6",{"$f":"Languages!B12","v":"Curved ramps for single directional traffic must have an external radius of minimum 8.00 metres with lane width of minimum 3.5 metres. For bidirectional curved ramps this applies for the inner driving lane. The outside driving lane must be minimum 3.5 metres wide as well. "}]
["1.7",{"$f":"Languages!B13","v":"Ramp gradients must not exceed 20% , to be measured at the middle of driving lane.  At bidirectional curved ramps this applies for the inner (steepest) driving lane."}]
["1.8",{"$f":"Languages!B14","v":"If the car park has paid parking and access control by barriers or gates, staff must be contactable at the pay point/exit point and secured pedestrian entries."}]
["1.9",{"$f":"Languages!B15","v":"Receipt for payment must be provided when requested."}]
["1.10",{"$f":"Languages!B16","v":"All turning movements must be capable of being completed without reversing (moving in/out the parking bay and cul-de-sacs excluded)"}]
["1.11",{"$f":"Languages!B17","v":"Average light levels on parking area at floor is at minimum 20 Lux"}]
[]
[null,{"$f":"Tags!B24","v":"Number of Ok:"},{"$f":"COUNTIF($C$4:$C$14,Options!B20)","v":0},null,{"$f":"Evaluation!M4","v":"Fail"}]
[null,{"$f":"Tags!B25","v":"Number of Fails:"},{"$f":"COUNTIF($C$4:$C$14,Options!B21)","v":0}]
[null,{"$f":"Tags!B26","v":"Not Evaluated:"},{"$f":"COUNTA(A4:A14)-C17-C16","v":11}]
[{"$f":"Tags!B60","v":"Notes"}]

{"sheet":"2. Lighting","index":4,"n_rows":29,"n_cols":8,"rows_kept":29,"cut":false,"hidden":false,"merged":[[25,1,25,2],[20,1,20,3],[15,3,16,3],[15,5,16,5],[2,7,5,7],[21,1,21,2],[22,1,22,2],[23,1,23,2],[24,1,24,2]]}
[2,{"$f":"Languages!B19","v":"Lighting"},null,null,{"$f":"IF(C6>0,Tags!B21,Tags!B20)","v":"Incompleted"},"Points:",{"$f":"F5*F6","v":0},{"$f":"F5","v":0}]
[]
[null,{"$f":"Tags!B30","v":"Total Items"},8,null,{"$f":"Tags!B34","v":"Score"},{"$f":"E18","v":0},null,{"$f":"Evaluation!M7","v":"Incomplete"}]
[null,{"$f":"Tags!B31","v":"Total Items + SubItems"},17,null,{"$f":"Tags!B35","v":"Maximum Score"},{"$f":"D18","v":46}]
[null,{"$f":"Tags!B32","v":"Itens Completed"},{"$f":"COUNTIF(D22:E26,\">=0\")+COUNTIF(C9:C15,\">=0\")","v":0},null,{"$f":"Tags!B36","v":"Percentage"},{"$f":"F3/F4","v":0}]
[null,{"$f":"Tags!B33","v":"Not measured"},{"$f":"C4-C5","v":17},null,{"$f":"Tags!B37","v":"Category Value"},{"$f":"VLOOKUP(A1,Evaluation!$A$7:$M$15,11)","v":16}]
[]
[2,{"$f":"Languages!B20","v":"Item List (values in Lux, see user manual for measurement)"},{"$f":"Tags!B56","v":"Measured value"},{"$f":"E4","v":"Maximum Score"},{"$f":"E3","v":"Score"},{"$f":"Tags!D57","v":"Maximum Contribuition for Final Score"},{"$f":"Tags!D58","v":"Contribuition for Final Score"},{"$f":"Tags!D59","v":"Remarks"}]
["2.1",{"$f":"Languages!B21","v":"Vehicular entry area; at floor level\r•  Above 200 Lux = 5;\r•  Between 75– 200 Lux: 0,04 pt per Lux over 75  \r•  Below 75 Lux = 0"},null,5,{"$f":"IF(C9>200,5,IF(C9<=75,0,(C9-75)*0.04))","v":0},{"$f":"D9/$F$4*$F$6","v":1.7391304347826086},{"$f":"E9/$F$4*$F$6","v":0}]
["2.2",{"$f":"Languages!B22","v":"Entry; at 1 m height near ticket-machine\r•  Above 200 Lux = 3;\r•  Between100– 200 Lux: 0,03 pt per Lux over 100\r•  Below 100 Lux = 0"},null,3,{"$f":"IF(C10>200,3,IF(C10<=100,0,(C10-100)*0.03))","v":0},{"$f":"D10/$D$18*$F$6","v":1.0434782608695652},0]
["2.3",{"$f":"Languages!B23","v":"Exit; at 1 m height near barrier/ticket-machine\r•  Above 200 Lux = 3;\r•  Between100– 200 Lux: 0,03 pt per Lux over 100\r•  Below 100 Lux= 0"},null,3,{"$f":"IF(C11>100,(IF(C11<200,(C11-100)*0.03,3)),0)","v":0},1.0434782608695652,0]
["2.4",{"$f":"Languages!B24","v":"At pay-machine; at 1 m height\r•  Above 200 Lux =4;\r•  Between100– 200 Lux: 0,04 pt per Lux over 100\r•  Below 100 Lux= 0;\r•  No Pay Machines : same as exit (enter zero if this is the case)"},null,4,{"$f":"IF(C12>100,(IF(C12<200,(C12-100)*0.04,4)),IF(AND(ISNUMBER(C12),C12=0),E11,0))","v":0},1.3913043478260869,0]
["2.5",{"$f":"Languages!B25","v":"At cashier; at counter height\r•  Above 200 Lux =4;\r•  Between100– 200 Lux: 0,04 pt per Lux over 100\r•  Below 100 Lux= 0;\r•  No cashier = 3 (enter zero if this is the case)"},null,4,{"$f":"IF(C13>100,(IF(C13<200,(C13-100)*0.04,4)),IF(AND(ISNUMBER(C13),(C13=0)),3,0))","v":0},1.3913043478260869,0]
["2.6",{"$f":"Languages!B26","v":"In elevator; at floor level\r•  Above 70 Lux = 4;\r•  Between30– 70 Lux: 0,1 pt per Lux over 30\r•  Below 30 Lux = 0;\r•  Single level without elevator = 3 (enter zero if this is the case)"},null,4,{"$f":"IF(C14>30,(IF(C14<70,(C14-30)*0.1,4)),IF(AND(ISNUMBER(C14),(C14=0)),3,0))","v":0},1.3913043478260869,0]
["2.7",{"$f":"Languages!B27","v":"In staircases and all other exclusive pedestrian routes; at floor level\r•  Above 90 Lux = 3;\r•  Between30– 90 Lux: 0,05 pt per Lux over 30\r•  Below 30 Lux = 0;"},null,3,{"$f":"IF(C15>30,(IF(C15<90,(C15-30)*0.05,3)),0)","v":0},1.0434782608695652,0]
["2.8",{"$f":"Languages!B28","v":"Light levels on parking area at floor level: (plesase fill grid below) \rAverage light level of grid:\r•  Above 100 Lux= 10;\r•  Between20– 100 Lux: 0,125 pt per Lux over 20 \r•  Below 20 Lux= 0"},{"$f":"IF(ISERROR(AVERAGE(D22:E26)),0,AVERAGE(D22:E26))","v":0},20,{"$f":"IF(C16>20,(IF(C16<100,(C16-20)*0.125,10)),0)","v":0},6.9565217391304346,0]
[null,{"$f":"Languages!B29","v":"Uniformity of light levels in grid as standard deviation\r•  Under 25% of avg light level = 10;\r•  Between25– 50%: 0,4 pt per % under 50%\r•  Above 50% =  0"},{"$f":"IF(ISERROR(_xlfn.STDEV.S(D22:E26)/C16),0,_xlfn.STDEV.S(D22:E26)/C16)","v":0},null,{"$f":"IF(ISERROR(_xlfn.STDEV.S(D22:E26)/C16),0,IF(C17>0.5,0,IF(C17<0.25,10,(0.5-C17)*40)))","v":0},null,{"$f":"E17/$D$18*$F$6","v":0}]
[null,{"$f":"CONCATENATE(Tags!$B$50,\" \",$B$1)","v":"Subtotals Lighting"},null,{"$f":"SUM(D9:D16)","v":46},{"$f":"SUM(E9:E17)","v":0},{"$f":"SUM(F9:F17)","v":16},{"$f":"SUM(G9:G17)","v":0}]
[]
[]
[null,{"$f":"Languages!B30","v":"Auxiliary Grid for 2.8"},{"$f":"VLOOKUP(#REF!,Languages!$A$4:$B$9972,2)","v":{"$error":"#REF!"}},{"$f":"VLOOKUP(#REF!,Languages!$A$4:$B$9972,2)","v":{"$error":"#REF!"}}]
[null,{"$f":"Languages!B31","v":"end of parking space under/between light fitting"}]
[null,{"$f":"Languages!B32","v":"halfway parking space under/between light fitting"}]
[null,{"$f":"Languages!B33","v":"edge of driveway under/between light fitting"}]
[null,{"$f":"Languages!B34","v":"center of driveway under/between light fitting"}]
[null,{"$f":"Languages!B35","v":"other edge of driveway under/between light fitting"}]
[]
[]
[{"$f":"Tags!B60","v":"Notes"}]

{"sheet":"3. Entry Exit","index":5,"n_rows":39,"n_cols":8,"rows_kept":39,"cut":false,"hidden":false,"merged":[[2,7,5,7],[14,0,18,0],[8,6,11,6],[8,3,11,3],[8,5,11,5],[8,7,11,7],[14,3,18,3],[14,5,18,5],[14,6,18,6],[14,7,18,7],[8,0,11,0],[27,3,33,3],[27,5,33,5],[27,7,33,7],[19,0,21,0],[19,3,21,3],[19,5,21,5],[19,7,21,7],[22,0,24,0],[22,3,24,3],[22,5,24,5],[22,7,24,7],[19,6,21,6],[27,6,33,6],[22,6,24,6]]}
[3,{"$f":"Languages!B36","v":"Car Entry / Car Exit"},null,null,{"$f":"IF(C6>0,Tags!B21,Tags!B20)","v":"Incompleted"},"Points:",{"$f":"F5*F6","v":0},{"$f":"F5","v":0}]
[]
[null,{"$f":"Tags!B30","v":"Total Items"},11,null,{"$f":"Tags!B34","v":"Score"},{"$f":"E37","v":0},null,{"$f":"Evaluation!M8","v":"Incomplete"}]
[null,{"$f":"Tags!B31","v":"Total Items + SubItems"},23,null,{"$f":"Tags!B35","v":"Maximum Score"},{"$f":"D37","v":29}]
[null,{"$f":"Tags!B32","v":"Itens Completed"},{"$f":"COUNTA(C10:C14,C16:C19,C21:C22,C24:C27,C29:C36)","v":0},null,{"$f":"Tags!B36","v":"Percentage"},{"$f":"F3/F4","v":0}]
[null,{"$f":"Tags!B33","v":"Not measured"},{"$f":"C4-C5","v":23},null,{"$f":"Tags!B37","v":"Category Value"},{"$f":"VLOOKUP(A1,Evaluation!$A$7:$M$15,11)","v":8}]
[]
[3,{"$f":"Tags!B55","v":"Item List"},{"$f":"Tags!B56","v":"Measured value"},{"$f":"E4","v":"Maximum Score"},{"$f":"E3","v":"Score"},{"$f":"Tags!D57","v":"Maximum Contribuition for Final Score"},{"$f":"Tags!D58","v":"Contribuition for Final Score"},{"$f":"Tags!D59","v":"Remarks"}]
["3.1",{"$f":"Languages!B37","v":"Car park headroom limit identified at entrance"},null,3,{"$f":"IF(ISERROR(E10+E11+E12),\"NA\",E10+E11+E12)","v":"NA"},{"$f":"D9/$F$4*$F$6","v":0.82758620689655171},{"$f":"IF(ISNUMBER(E9),E9/$F$4*$F$6,0)","v":0}]
[null,{"$f":"Languages!B38","v":"Correct sign at entrance"},null,null,{"$f":"IF(C10=Options!$B$23,1,IF(C10=Options!$B$24,0,\"NA\"))","v":"NA"}]
[null,{"$f":"Languages!B39","v":"Height barrier"},null,null,{"$f":"IF(C11=Options!$B$23,1,IF(C11=Options!$B$24,0,\"NA\"))","v":"NA"}]
[null,{"$f":"Languages!B40","v":"Rubber lip to prevent damage"},null,null,{"$f":"IF(C12=Options!$B$23,1,IF(C12=Options!$B$24,0,\"NA\"))","v":"NA"}]
["3.2",{"$f":"Languages!B41","v":"Height:\r(The car park should receive one point for each 10cm of height above 1.90m up to 2.20 m)"},null,3,{"$f":"IF(ISNUMBER(C13),IF(C13>1.9,(IF(C13<2.2,(C13-1.9)*10,3)),0),\"NA\")","v":"NA"},{"$f":"D13/$F$4*$F$6","v":0.82758620689655171},{"$f":"IF(ISNUMBER(E13),E13/$F$4*$F$6,0)","v":0}]
["3.3",{"$f":"Languages!B42","v":"Traffic signs to define limitations in use of facility.\r• Clear signing = 3\r• Incomplete signing = 2\r• No signing = 0)"},null,3,{"$f":"IF(C14=Options!B26,3,IF(C14=Options!B27,2,IF(C14=Options!B28,0,\"NA\")))","v":"NA"},{"$f":"D14/$F$4*$F$6","v":0.82758620689655171},{"$f":"IF(ISNUMBER(E14),E14/$F$4*$F$6,0)","v":0}]
["3.4",{"$f":"Languages!B43","v":"Information on:"},null,4,{"$f":"IF(ISERROR(E16+E17+E18+E19),\"NA\",E16+E17+E18+E19)","v":"NA"},{"$f":"D15/$F$4*$F$6","v":1.103448275862069},{"$f":"IF(ISNUMBER(E15),E15/$F$4*$F$6,0)","v":0}]
[null,{"$f":"Languages!B44","v":"Operators terms & conditions within the car park:"},null,null,{"$f":"IF(C16=yes,1,IF(C16=no,0,\"NA\"))","v":"NA"}]
[null,{"$f":"Languages!B45","v":"Daily opening hours:"},null,null,{"$f":"IF(C17=yes,1,IF(C17=no,0,\"NA\"))","v":"NA"}]
[null,{"$f":"Languages!B46","v":"Scale of tariffs:"},null,null,{"$f":"IF(C18=yes,1,IF(C18=no,0,\"NA\"))","v":"NA"}]
[null,{"$f":"Languages!B47","v":"Readibility of tariff system:"},null,null,{"$f":"IF(C19=yes,1,IF(C19=no,0,\"NA\"))","v":"NA"}]
["3.5",{"$f":"Languages!B48","v":"Design entry/exit area"},null,2,{"$f":"IF(ISERROR(E21+E22),\"NA\",E21+E22)","v":"NA"},{"$f":"D20/$F$4*$F$6","v":0.55172413793103448},{"$f":"IF(ISNUMBER(E20),E20/$F$4*$F$6,0)","v":0}]
[null,{"$f":"Languages!B49","v":"Entry ticket- machine easy to reach:"},null,null,{"$f":"IF(C21=yes,1,IF(C21=no,0,\"\"))","v":""}]
[null,{"$f":"Languages!B50","v":"Exit ticket- machine easy to reach:"},null,null,{"$f":"IF(C22=yes,1,IF(C22=no,0,\"\"))","v":""}]
["3.6",{"$f":"Languages!B51","v":"Longitudinal slope at the ticket machines"},null,2,{"$f":"IF(ISERROR(E24+E25),\"NA\",E24+E25)","v":"NA"},{"$f":"D23/$F$4*$F$6","v":0.55172413793103448},{"$f":"IF(ISNUMBER(E23),E23/$F$4*$F$6,0)","v":0}]
[null,{"$f":"Languages!B52","v":"Entry lane:\r• 0-2% (car doesn’t move without brake) = 1\r• 2-5% = 0\r• Above 5% = -1"},null,null,{"$f":"IF(C24=Options!B30,1,IF(C24=Options!B31,0,IF(C24=Options!B32,-1,\"NA\")))","v":"NA"}]
[null,{"$f":"Languages!B53","v":"Exit lane:\r• 0-2% (car doesn’t move without brake) = 1\r• 2-5% = 0\r• Above 5% = -1"},null,null,{"$f":"IF(C25=Options!B30,1,IF(C25=Options!B31,0,IF(C25=Options!B32,-1,\"NA\")))","v":"NA"}]
["3.7",{"$f":"Languages!B54","v":"Kerb design to avoid damage to average vehicle’s wheels:\r(Yes = 2, No protection = 0, No kerbs in entry/exit area = 2)"},null,2,{"$f":"IF(C26=Options!B34,2,IF(Options!B35=C26,0,(IF(C26=Options!B36,2,\"NA\"))))","v":"NA"},{"$f":"D26/$F$4*$F$6","v":0.55172413793103448},{"$f":"IF(ISNUMBER(E26),E26/$F$4*$F$6,0)","v":0}]
["3.8",{"$f":"Languages!B55","v":"Anti slip surfaces access/egress ramps:\r(Anti slip = 1, Slippery when wet = 0)"},null,1,{"$f":"IF(C27=Options!B38,1,IF(C27=Options!B39,0,\"NA\"))","v":"NA"},{"$f":"D27/$F$4*$F$6","v":0.27586206896551724},{"$f":"IF(ISNUMBER(E27),E27/$F$4*$F$6,0)","v":0}]
["3.9",{"$f":"Languages!B56","v":"Access security"},null,6,{"$f":"IF(ISERROR(E29+E30+E31+E32+E33+E34),\"NA\",SUM(E29:E34))","v":"NA"},{"$f":"D28/$F$4*$F$6","v":1.6551724137931034},{"$f":"IF(ISNUMBER(E28),E28/$F$4*$F$6,0)","v":0}]
[null,{"$f":"Languages!B57","v":"Barrier"},null,null,{"$f":"IF(C29=yes,1,IF(C29=no,0,\"NA\"))","v":"NA"}]
[null,{"$f":"Languages!B58","v":"Intercom"},null,null,"NA"]
[null,{"$f":"Languages!B59","v":"CCTV"},null,null,"NA"]
[null,{"$f":"Languages!B60","v":"Licence Plate Recognition"},null,null,"NA"]
[null,{"$f":"Languages!B61","v":"Full height fast closing gates"},null,null,"NA"]
[null,{"$f":"Languages!B62","v":"Staffed access(Entry or exit)"},null,null,"NA"]
["3.10",{"$f":"Languages!B63","v":"Entry/Exit of the building: width between structure (per lane)\r(< 3 m =0, 3 – 3.3 m =1, > 3.3 m = 2)"},null,2,{"$f":"IF(C35=Options!B41,0,IF(C35=Options!B42,1,IF(C35=Options!B43,2,\"NA\")))","v":"NA"},{"$f":"D35/$F$4*$F$6","v":0.55172413793103448},{"$f":"IF(ISNUMBER(E35),E35/$F$4*$F$6,0)","v":0}]
["3.11",{"$f":"Languages!B64","v":"Exit: exit slope ends at least 5 meters before crossing traffic (pedestrians/cyclists):"},null,1,{"$f":"IF(C36=yes,1,IF(C36=yes,0,\"NA\"))","v":"NA"},{"$f":"D36/$F$4*$F$6","v":0.27586206896551724},{"$f":"IF(ISNUMBER(E36),E36/$F$4*$F$6,0)","v":0}]
[null,{"$f":"CONCATENATE(Tags!$B$50,\" \",$B$1)","v":"Subtotals Car Entry / Car Exit"},null,{"$f":"SUM(D9:D36)","v":29},{"$f":"SUM(E9,E13,E14,E15,E20,E23,E26,E27,E28,E35,E36)","v":0},{"$f":"SUM(F9:F36)","v":8},{"$f":"SUM(G9:G36)","v":0}]
[]
[{"$f":"Tags!B60","v":"Notes"}]

{"sheet":"4. Parking Area","index":6,"n_rows":72,"n_cols":8,"rows_kept":72,"cut":false,"hidden":false,"merged":[[27,0,31,0],[27,3,31,3],[27,5,31,5],[27,6,31,6],[23,7,26,7],[27,7,31,7],[2,7,5,7],[10,7,19,7],[20,7,22,7],[20,0,22,0],[23,0,26,0],[23,3,26,3],[23,5,26,5],[23,6,26,6],[10,0,19,0],[10,3,19,3],[10,5,19,5],[10,6,19,6],[20,3,22,3],[20,5,22,5],[20,6,22,6]]}
[4,{"$f":"Languages!B66","v":"Parking Area"},null,null,{"$f":"IF(C6>0,Tags!B21,Tags!B20)","v":"Incompleted"},"Points:",{"$f":"F6*F5","v":0},{"$f":"F5","v":0}]
[]
[null,{"$f":"Tags!B30","v":"Total Items"},10,null,{"$f":"Tags!B34","v":"Score"},{"$f":"E37","v":0},null,{"$f":"Evaluation!M9","v":"Incomplete"}]
[null,{"$f":"Tags!B31","v":"Total Items + SubItems"},22,null,{"$f":"Tags!B35","v":"Maximum Score"},{"$f":"F38+D37","v":43}]
[null,{"$f":"Tags!B32","v":"Itens Completed"},{"$f":"COUNTA(C9:C10,C12,C14:C16,C18:C20,C22:C23,C25:C27,C29:C36)","v":0},null,{"$f":"Tags!B36","v":"Percentage"},{"$f":"F3/F4","v":0}]
[null,{"$f":"Tags!B33","v":"Not measured"},{"$f":"C4-C5","v":22},null,{"$f":"Tags!B37","v":"Category Value"},{"$f":"VLOOKUP(A1,Evaluation!$A$7:$M$15,11)","v":20}]
[]
[4,{"$f":"Tags!B55","v":"Item List"},{"$f":"Tags!B56","v":"Measured value"},{"$f":"E4","v":"Maximum Score"},{"$f":"E3","v":"Score"},{"$f":"Tags!D57","v":"Maximum Contribuition for Final Score"},{"$f":"Tags!D58","v":"Contribuition for Final Score"},{"$f":"Tags!D59","v":"Remarks"}]
["4.1",{"$f":"Languages!B67","v":"Pillar placement for at least 85% of bays:\r• does not intrude into the parking area = 8 \r• at beginning of stall = 0\r• next to car door = 0\r• at back of stall but intrudes into the parking area = 4"},null,8,{"$f":"IF(C9=Options!B45,8,(IF(OR(C9=Options!B46,C9=Options!B47),0,IF(C9=Options!B48,4,\"NA\"))))","v":"NA"},{"$f":"D9/$F$4*$F$6","v":3.7209302325581395},{"$f":"IF(ISNUMBER(E9),E9/$F$4*$F$6,0)","v":0}]
["4.2",{"$f":"Languages!B68","v":"Visibility (many/few dead corners, walls in the car park etc.)\rGood=4, Medium=2 or Bad=0"},null,4,{"$f":"IF(C10=Options!B50,4,IF(C10=Options!B52,0,IF(C10=Options!B51,2,\"NA\")))","v":"NA"},{"$f":"D10/$F$4*$F$6","v":1.8604651162790697},{"$f":"IF(ISNUMBER(E10),E10/$F$4*$F$6,0)","v":0}]
["4.3",{"$f":"Languages!B69","v":"Signage for car driver:"},null,7,{"$f":"IF(ISERROR(E12+E14+E15+E16+E18+E19+E20),\"NA\",E12+SUM(E14:E16)+SUM(E18:E20))","v":"NA"},{"$f":"D11/$F$4*$F$6","v":3.2558139534883725},{"$f":"IF(ISNUMBER(E11),E11/$F$4*$F$6,0)","v":0}]
[null,{"$f":"Languages!B70","v":"Do traffic signs conform to national road code?"},null,null,{"$f":"IF(C12=yes,1,IF(C12=no,0,\"NA\"))","v":"NA"}]
[null,{"$f":"Languages!B71","v":"Routing and turn signs: Is signage clear, complete and unambiguous? "}]
[null,{"$f":"Languages!B72","v":"Complete ?"},null,null,{"$f":"IF(C14=yes,1,IF(C14=no,0,\"NA\"))","v":"NA"}]
[null,{"$f":"Languages!B73","v":"Easy to see ?"},null,null,{"$f":"IF(C15=yes,1,IF(C15=no,0,\"NA\"))","v":"NA"}]
[null,{"$f":"Languages!B74","v":"Unambiguous ?"},null,null,{"$f":"IF(C16=yes,1,IF(C16=no,0,\"NA\"))","v":"NA"}]
[null,{"$f":"Languages!B75","v":"Exit signs in the car park: Is signage clear, complete and unambiguous? "}]
[null,{"$f":"Languages!B76","v":"Complete ?"},null,null,{"$f":"IF(C18=yes,1,IF(C18=no,0,\"NA\"))","v":"NA"}]
[null,{"$f":"Languages!B77","v":"Easy to see ?"},null,null,{"$f":"IF(C19=yes,1,IF(C19=no,0,\"NA\"))","v":"NA"}]
[null,{"$f":"Languages!B78","v":"Unambiguous ?"},null,null,{"$f":"IF(C20=yes,1,IF(C20=no,0,\"NA\"))","v":"NA"}]
["4.4",{"$f":"Languages!B79","v":"Parking bay marks"},null,2,{"$f":"IF(ISERROR(E22+E23),\"NA\",SUM(E22:E23))","v":"NA"},{"$f":"D21/$F$4*$F$6","v":0.93023255813953487},{"$f":"IF(ISNUMBER(E21),E21/$F$4*$F$6,0)","v":0}]
[null,{"$f":"Languages!B80","v":"Parking bays are clearly marked ?"},null,null,{"$f":"IF(C22=yes,1,IF(C22=no,0,\"NA\"))","v":"NA"}]
[null,{"$f":"Languages!B81","v":"Bay markings extend up walls to assist driver ?"},null,null,{"$f":"IF(C23=yes,1,IF(C23=no,0,\"NA\"))","v":"NA"}]
["4.5",{"$f":"Languages!B82","v":"Are Road Markings:"},null,3,{"$f":"IF(ISERROR(E25+E26+E27),\"NA\",SUM(E25:E27))","v":"NA"},{"$f":"D24/$F$4*$F$6","v":1.3953488372093024},{"$f":"IF(ISNUMBER(E24),E24/$F$4*$F$6,0)","v":0}]
[null,{"$f":"Languages!B83","v":"Complete ?"},null,null,{"$f":"IF(C25=yes,1,IF(C25=no,0,\"NA\"))","v":"NA"}]
[null,{"$f":"Languages!B84","v":"Easy to see ?"},null,null,{"$f":"IF(C26=yes,1,IF(C26=no,0,\"NA\"))","v":"NA"}]
[null,{"$f":"Languages!B85","v":"Unambiguous ?"},null,null,{"$f":"IF(C27=yes,1,IF(C27=no,0,\"NA\"))","v":"NA"}]
["4.6",{"$f":"Languages!B86","v":"Availability of spaces for disabled with wheelchair access anounced at the entrance the car park:"},null,4,{"$f":"IF(ISERROR(E29+E30+E31+E32),\"NA\",SUM(E29:E32))","v":"NA"},{"$f":"D28/$F$4*$F$6","v":1.8604651162790697},{"$f":"IF(ISNUMBER(E28),E28/$F$4*$F$6,0)","v":0}]
[null,{"$f":"Languages!B87","v":"Accessible for wheelchair ?"},null,null,{"$f":"IF(C29=yes,1,IF(C29=no,0,\"NA\"))","v":"NA"}]
[null,{"$f":"Languages!B88","v":"Bays minimum 3.5 m wide ?"},null,null,{"$f":"IF(C30=yes,1,IF(C30=no,0,\"NA\"))","v":"NA"}]
[null,{"$f":"Languages!B89","v":"Close to pedestrian exit ?"},null,null,{"$f":"IF(C31=yes,1,IF(C31=no,0,\"NA\"))","v":"NA"}]
[null,{"$f":"Languages!B90","v":"Guidance to disabled spaces ?"},null,null,{"$f":"IF(C32=yes,1,IF(C32=no,0,\"NA\"))","v":"NA"}]
["4.7",{"$f":"Languages!B91","v":"Parking angle at 85 % of bays:\r(Angle 76-90° = 0, Angle  45-75° = 2)"},null,2,{"$f":"IF(C33=Options!B54,0,IF(C33=Options!B55,2,\"NA\"))","v":"NA"},{"$f":"D33/$F$4*$F$6","v":0.93023255813953487},{"$f":"IF(ISNUMBER(E33),E33/$F$4*$F$6,0)","v":0}]
["4.8",{"$f":"Languages!B92","v":"Width of bays (85 % of bays), A or B: \rA: Parking angle 76 – 90 degrees\r(2.25m = -5, 2.30m = 0, 2.35m = 2, 2.40m = 4, 2.45m = 6, 2.50m = 8) \rB: Parking angle 45-75 degrees\r(2.25m = -5, 2.30m = 1, 2.35m = 3, 2.40m = 5, 2.45m = 8)\rWidth of 2.25m only applies for renovated car parks, new car parks must be minimum 2.30m"},null,8,{"$f":"IF(ISERROR(VLOOKUP(option4_8,'4. Parking Area'!D63:G69,D60)),\"NA\",VLOOKUP(option4_8,'4. Parking Area'!D63:G69,D60))","v":"NA"},{"$f":"D34/$F$4*$F$6","v":3.7209302325581395},{"$f":"IF(ISNUMBER(E34),E34/$F$4*$F$6,0)","v":0}]
["4.9",{"$f":"Languages!B93","v":"Total unit measure of one way isle width and\rdepth of two parking bays, depending on parking angle and bay width:\rBay width: 2.50m / 2.45m / 2.40m / 2.35m / 2.30m\r90° :           16.00 /  16.30 /  16.60 /  16.90 / 17.30\r85° :           15.70 /  16.00 /  16.30 /  16.60 / 16.95\r80° :           15.40 /  15.70 /  16.00 /  16.30 / 16.60\r75° :           14.95 /  15.25 /  15.55 /  15.85 / 16.15\r70° :           14.50 /  14.80 /  15.10 /  15.40 / 15.70\r65° :           14.40 /  14.40 /  14.55 /  14.80 / 15.10\r60° :           14.30 /  14.30 /  14.30 /  14.30 / 14.50\r55° :           14.00 /  14.00 /  14.00 /  14.00 / 14.10\r50° :           13.75 /  13.75 /  13.75 /  13.75 / 13.75\r45° :           13.50 /  13.50 /  13.50 /  13.50 / 13.50\r\rTotal unit measure as above qualifies for 3 points. \rUp to 30 cm less qualifies for 2 points\rUp to 60 cm less qualifies for 1 point\rMore than 60 cm less: no points given"},null,3,{"$f":"IF(C35=Options!B64,3,IF(C35=Options!B65,2,IF(C35=Options!B66,1,IF(C35=Options!B67,0,\"NA\"))))","v":"NA"},{"$f":"D35/$F$4*$F$6","v":1.3953488372093024},{"$f":"IF(ISNUMBER(E35),E35/$F$4*$F$6,0)","v":0}]
["4.10",{"$f":"Languages!B94","v":"Kerb design to avoid damage to average vehicle’s wheels\r•  Yes = 2, No protection = 0"},null,2,{"$f":"IF(C36=Options!B34,2,IF(C36=Options!B35,0,\"NA\"))","v":"NA"},{"$f":"D36/$F$4*$F$6","v":0.93023255813953487},{"$f":"IF(ISNUMBER(E36),E36/$F$4*$F$6,0)","v":0}]
[null,{"$f":"CONCATENATE(Tags!$B$50,\" \",$B$1)","v":"Subtotals Parking Area"},null,{"$f":"SUM(D9:D36)","v":43},{"$f":"SUM(E36,E35,E34,E33,E28,E24,E21,E11,E10,E9)","v":0},{"$f":"SUM(F9:F36)","v":20.000000000000004},{"$f":"SUM(G9:G36)","v":0}]
[]
[{"$f":"Tags!B60","v":"Notes"}]
[]
[]
[]
[]
[]
[]
[]
[]
[]
[]
[]
[]
[]
[]
[]
[]
[]
[]
[]
[]
[null,null,"Coluna",{"$f":"IF(opt_angle=D71,2,IF(opt_angle=D72,3,4))","v":4},null,"Option 4_8:",{"$f":"MATCH('4. Parking Area'!$C$34,$C$63:$C$68)","v":{"$error":"#N/A"}}]
[]
[null,null,null,"Opção","76-90","45-75","Column2"]
[null,null,{"$f":"Options!B57","v":" 2.25 m - 2.30 m"},1,-5,-5,"NA"]
[null,null,{"$f":"Options!B58","v":" 2.30 m - 2.35 m"},2,0,1,"NA"]
[null,null,{"$f":"Options!B59","v":" 2.35 m - 2.40 m"},3,2,3,"NA"]
[null,null,{"$f":"Options!B60","v":" 2.40 m - 2.45 m"},4,4,5,"NA"]
[null,null,{"$f":"Options!B61","v":" 2.45 m - 2.50 m"},5,6,8,"NA"]
[null,null,{"$f":"Options!B62","v":" above 2.50 m"},6,8,8,"NA"]
[null,null,null,null,"NA","NA","NA"]
[]
[null,null,"4.7:",{"$f":"Options!B54","v":"Angle 76°-90°"}]
[null,null,null,{"$f":"Options!B55","v":"Angle  45°-75°"}]

{"sheet":"5. Ramps","index":7,"n_rows":46,"n_cols":8,"rows_kept":46,"cut":false,"hidden":false,"merged":[[2,7,5,7],[11,6,13,6],[11,7,13,7],[11,0,13,0],[8,0,8,1],[11,3,13,3],[11,4,13,4],[11,5,13,5]]}
[5,{"$f":"Languages!B95","v":"Vehicle Ramps"},null,null,{"$f":"IF(C6>0,Tags!B21,Tags!B20)","v":"Incompleted"},"Points:",{"$f":"F5*F6","v":0},{"$f":"F5","v":0}]
[]
[null,{"$f":"Tags!B30","v":"Total Items"},{"$f":"IF(C9=yes,1,7)","v":7},null,{"$f":"Tags!B34","v":"Score"},{"$f":"E18","v":0},null,{"$f":"Evaluation!M10","v":"Incomplete"}]
[null,{"$f":"Tags!B31","v":"Total Items + SubItems"},{"$f":"IF(C9=yes,1,7)","v":7},null,{"$f":"Tags!B35","v":"Maximum Score"},{"$f":"D18","v":13}]
[null,{"$f":"Tags!B32","v":"Itens Completed"},{"$f":"IF(C9=yes,1,COUNTA(C10:C11,C13:C17))","v":0},null,{"$f":"Tags!B36","v":"Percentage"},{"$f":"F3/F4","v":0}]
[null,{"$f":"Tags!B33","v":"Not measured"},{"$f":"C4-C5","v":7},null,{"$f":"Tags!B37","v":"Category Value"},{"$f":"VLOOKUP(A1,Evaluation!$A$7:$M$15,11)","v":8}]
[]
[5,{"$f":"Tags!B55","v":"Item List"},{"$f":"Tags!B56","v":"Measured value"},{"$f":"E4","v":"Maximum Score"},{"$f":"E3","v":"Score"},{"$f":"Tags!D57","v":"Maximum Contribuition for Final Score"},{"$f":"Tags!D58","v":"Contribuition for Final Score"},{"$f":"Tags!D59","v":"Remarks"}]
[{"$f":"Languages!B96","v":"Is this a Single level car park without vehicular ramps or ramper floor?"},{"$f":"VLOOKUP(#REF!,Language_Table,2)","v":{"$error":"#REF!"}},null,10,{"$f":"IF(C9=yes,10,0)","v":0},{"$f":"D9/$F$4*$F$6","v":6.1538461538461542},{"$f":"IF(ISNUMBER(E9),E9/$F$4*$F$6,0)","v":0}]
["5.1",{"$f":"Languages!B97","v":"Ramp surface between parking areas (Anti slip 1, Smooth 0, no ramps 1)"},null,1,{"$f":"IF(noramps<>yes,IF(C10=Options!B69,1,IF(C10=Options!B70,0,IF(C10=Options!B71,1,\"NA\"))),\"SLP\")","v":"NA"},{"$f":"D10/$F$4*$F$6","v":0.61538461538461542},{"$f":"IF(ISNUMBER(E10),E10/$F$4*$F$6,0)","v":0}]
["5.2",{"$f":"Languages!B98","v":"Ramp longitudinal gradient connecting ramps (not used for parking)\r•  <10%=3, 10-15%=1, >15%=0, no ramps=3"},null,3,{"$f":"IF(noramps=no,IF(C11=Options!B194,3,IF(C11=Options!B195,1,IF(C11=Options!B196,0,IF(C11=Options!B197,3,\"NA\")))),\"SLP\")","v":"SLP"},{"$f":"D11/$F$4*$F$6","v":1.8461538461538463},{"$f":"IF(ISNUMBER(E11),E11/$F$4*$F$6,0)","v":0}]
["5.3",{"$f":"Languages!B99","v":"Ramp width (between kerbs) all ramps measured at narrowest point "},null,2,{"$f":"IF(noramps=no,IF(C14=A43,0,IF(C14=A44,1,IF(C14=A45,2,IF(C14=A46,2,\"NA\")))),\"SLP\")","v":"SLP"},1.2307692307692308,{"$f":"IF(ISNUMBER(E12),E11/$F$4*$F$6,0)","v":0}]
[null,{"$f":"Languages!B100","v":"Curved ramps must be 1 m wider for same score. Are the ramps curbed?"}]
[null,{"$f":"Languages!B101","v":"Please choose width. < 3m=0, 3-3.3m=1, >3.3m=2, no ramps=2"}]
["5.4",{"$f":"Languages!B102","v":"Ramp curvature (external radius) curved ramps\r•  up to 9m=0, 9–10 m=1, >10m=2, no ramps=2\rAt dual way ramps this measure refers to the inner lane."},null,2,{"$f":"IF(noramps<>yes,IF(C15=Options!B209,0,IF(C15=Options!B210,1,IF(C15=Options!B211,2,IF(C15=Options!B212,2,\"NA\")))),\"SLP\")","v":"NA"},1.2307692307692308,{"$f":"IF(ISNUMBER(E15),E15/$F$4*$F$6,0)","v":0}]
["5.5",{"$f":"Languages!B103","v":"Approach curve to straight ramps\r•  <7.5m=0, 7.5–9m=1, >9m=2, no ramps=2"},null,2,{"$f":"IF(noramps<>yes,IF(C16=Options!B214,0,IF(C16=Options!B215,1,IF(C16=Options!B216,2,IF(C16=Options!B217,2,\"NA\")))),\"SLP\")","v":"NA"},1.2307692307692308,{"$f":"IF(ISNUMBER(E16),E16/$F$4*$F$6,0)","v":0}]
["5.6",{"$f":"Languages!B104","v":"Ramped parking floor longitudinal gradient\r•  <5%=3, 5-7 =1, >7%=0, no gradient=3"},null,3,{"$f":"IF(noramps<>yes,IF(C17=Options!B219,3,IF(C17=Options!B220,1,IF(C17=Options!B221,0,IF(C17=Options!B222,3,\"NA\")))),\"SLP\")","v":"NA"},1.8461538461538463,{"$f":"IF(ISNUMBER(E17),E17/$F$4*$F$6,0)","v":0}]
[null,{"$f":"CONCATENATE(Tags!$B$50,\" \",$B$1)","v":"Subtotals Vehicle Ramps"},null,{"$f":"SUM(D10:D17)","v":13},{"$f":"SUM(E9:E17)","v":0},{"$f":"SUM(F10:F17)","v":8},{"$f":"SUM(G9:G17)","v":0}]
[]
[{"$f":"Tags!B60","v":"Notes"}]
[]
[]
[]
[]
[]
[]
[]
[]
[]
[]
[]
[]
[]
[]
[]
[]
[]
[]
[]
[]
["Auxiliar for 5.3"]
[]
[{"$f":"IF($C$13=no,Options!B199,Options!B204)","v":"< 4m"}]
[{"$f":"IF($C$13=no,Options!B200,Options!B205)","v":"4m - 4.3m"}]
[{"$f":"IF($C$13=no,Options!B201,Options!B206)","v":">4.3m"}]
[{"$f":"IF($C$13=no,Options!B202,Options!B207)","v":"no ramps"}]

{"sheet":"6. Pedestrian Access","index":8,"n_rows":38,"n_cols":8,"rows_kept":38,"cut":false,"hidden":false,"merged":[[22,3,25,3],[22,5,25,5],[22,6,25,6],[22,7,25,7],[29,0,33,0],[29,3,33,3],[29,5,33,5],[29,6,33,6],[29,7,33,7],[26,0,28,0],[26,3,28,3],[26,5,28,5],[26,6,28,6],[26,7,28,7],[22,0,25,0],[2,7,5,7],[18,6,20,6],[18,7,20,7],[9,3,9,6],[8,0,8,1],[9,0,9,1],[18,0,20,0],[18,3,20,3],[18,5,20,5],[10,0,10,1]]}
[6,{"$f":"Languages!B105","v":"Pedestrian Access"},null,null,{"$f":"IF(C6>0,Tags!B21,Tags!B20)","v":"Incompleted"},"Points:",{"$f":"F5*F6","v":0},{"$f":"F5","v":0}]
[]
[null,{"$f":"Tags!B30","v":"Total Items"},13,null,{"$f":"Tags!B34","v":"Score"},{"$f":"E36","v":0},null,{"$f":"Evaluation!M11","v":"Incomplete"}]
[null,{"$f":"Tags!B31","v":"Total Items + SubItems"},{"$f":"IF(slcp=yes,5,23-2*(essl=no)-7*(emvc=yes))","v":23},null,{"$f":"Tags!B35","v":"Maximum Score"},{"$f":"D36","v":43}]
[null,{"$f":"Tags!B32","v":"Itens Completed"},{"$f":"COUNTA(C12:C15,C9:C9)+COUNTA(C10:C11,C16:C35)*(slcp=no)-COUNTA(C16:C17)*(essl=no)-COUNTA(C28:C35)*(emvc=yes)","v":0},null,{"$f":"Tags!B36","v":"Percentage"},{"$f":"F3/F4","v":0}]
[null,{"$f":"Tags!B33","v":"Not measured"},{"$f":"C4-C5","v":23},null,{"$f":"Tags!B37","v":"Category Value"},{"$f":"VLOOKUP(A1,Evaluation!$A$7:$M$15,11)","v":16}]
[]
[6,{"$f":"Tags!B55","v":"Item List"},{"$f":"Tags!B56","v":"Measured value"},{"$f":"E4","v":"Maximum Score"},{"$f":"E3","v":"Score"},{"$f":"Tags!D57","v":"Maximum Contribuition for Final Score"},{"$f":"Tags!D58","v":"Contribuition for Final Score"},{"$f":"Tags!D59","v":"Remarks"}]
[{"$f":"Languages!B115","v":"Is this a Single level car park at ground floor, (not open surface) ?"},{"$f":"VLOOKUP(#REF!,Language_Table,2)","v":{"$error":"#REF!"}},null,25,{"$f":"IF(C9=yes,D9,0)","v":0},{"$f":"D9/$F$4*$F$6","v":9.3023255813953494},{"$f":"IF(ISNUMBER(E9),E9/$F$4*$F$6,0)","v":0}]
[{"$f":"Languages!B116","v":"Is there elevators serving street level?"},{"$f":"VLOOKUP(#REF!,Language_Table,2)","v":{"$error":"#REF!"}}]
[{"$f":"Languages!B128","v":"Are elevators the main vertical connection? (stairs only secondary or escape)"},{"$f":"VLOOKUP(#REF!,Language_Table,2)","v":{"$error":"#REF!"}},null,8,{"$f":"IF(slcp=yes,0,IF(emvc=yes,8,0))","v":0},{"$f":"D11/$F$4*$F$6","v":2.9767441860465116},{"$f":"IF(ISNUMBER(E11),E11/$F$4*$F$6,0)","v":0}]
["6.1",{"$f":"Languages!B107","v":"Headroom for pedestrians - excluding doors\r• <2.00m = 0\r• 2.00m – 2.10m = 1\r• 2.10m – 2.20m = 2\r• > 2.20m = 3"},null,3,{"$f":"IF(ISERROR(IF(C12=Options!B73,0,IF(C12=Options!B74,1,IF(C12=Options!B75,2,IF(C12=Options!B76,3,\"NA\"))))),\"NA\",IF(C12=Options!B73,0,IF(C12=Options!B74,1,IF(C12=Options!B75,2,IF(C12=Options!B76,3,\"NA\")))))","v":"NA"},{"$f":"D12/$F$4*$F$6","v":1.1162790697674418},{"$f":"IF(ISNUMBER(E12),E12/$F$4*$F$6,0)","v":0}]
["6.2",{"$f":"Languages!B108","v":"Separate walking route (i.e. heightened; zebra stripes or colours) (yes = 2, no = 0)"},null,2,{"$f":"IF(C13=yes,2,IF(C13=no,0,\"NA\"))","v":"NA"},{"$f":"D13/$F$4*$F$6","v":0.7441860465116279},{"$f":"IF(ISNUMBER(E13),E13/$F$4*$F$6,0)","v":0}]
["6.3",{"$f":"Languages!B109","v":"Are pedestrian entrance doors easy to use?\r(Yes, automatic or open connection = 4, Easy to open = 2, No = 0)"},null,4,{"$f":"IF(C14=Options!B78,4,IF(C14=Options!B79,2,IF(C14=Options!B80,0,\"NA\")))","v":"NA"},1.4883720930232558,0]
["6.4",{"$f":"Languages!B110","v":"Pedestrian access controlled by ticket/pass card when car park open (Yes=1, No=0)"},null,1,{"$f":"IF(C15=yes,1,IF(C15=no,0,\"NA\"))","v":"NA"},0.37209302325581395,0]
["6.5",{"$f":"Languages!B117","v":"Number of Elevators at street level:\r(1 elevator = 1, 2 + elevators = 5)"},null,5,{"$f":"IF(slcp=no,IF(essl=yes,IF(C16=Options!B86,1,IF(C16=Options!B87,5,\"NA\")),\"NA\"),\"NA\")","v":"NA"},{"$f":"D16/$F$4*$F$6","v":1.8604651162790697},{"$f":"IF(ISNUMBER(E16),E16/$F$4*$F$6,0)","v":0}]
["6.6",{"$f":"Languages!B118","v":"Size of elevators:\r(More Than 8 people = 3, 4-8 people = 1, less than 4 = 0)"},null,3,{"$f":"IF(slcp=no,IF(essl=yes,IF(C17=Options!B89,3,IF(C17=Options!B90,1,IF(C17=Options!B91,0,\"NA\"))),\"NA\"),\"NA\")","v":"NA"},1.1162790697674418,0]
["6.7",{"$f":"Languages!B119","v":"Visibility from elevator inside to hall/parking area\r(no visibility from elevator = 0, glazed doors/walls = 3, no elevator = 0)"},null,3,{"$f":"IF(slcp=no,IF(C18=Options!B93,0,IF(C18=Options!B94,3,IF(C18=Options!B95,0,\"NA\"))),\"NA\")","v":"NA"},{"$f":"D18/$F$4*$F$6","v":1.1162790697674418},{"$f":"IF(ISNUMBER(E18),E18/$F$4*$F$6,0)","v":0}]
["6.8",{"$f":"Languages!B120","v":"Level indication:"},null,2,{"$f":"IF(ISERROR(E20+E21),\"NA\",E20+E21)","v":"NA"},{"$f":"D19/$F$4*$F$6","v":0.7441860465116279},{"$f":"IF(ISNUMBER(E19),E19/$F$4*$F$6,0)","v":0}]
[null,{"$f":"Languages!B121","v":"in elevator:"},null,null,{"$f":"IF(slcp=no,IF(C20=yes,1,IF(C20=no,0,\"NA\")),\"NA\")","v":"NA"}]
[null,{"$f":"Languages!B122","v":"in elevator foyer:"},null,null,{"$f":"IF(slcp=no,IF(C21=yes,1,IF(C21=no,0,\"NA\")),\"NA\")","v":"NA"}]
["6.9",{"$f":"Languages!B123","v":"Elevator control buttons at wheelchair height\r•  Yes = 1, Other = 0"},null,1,{"$f":"IF(slcp=no,IF(C22=yes,1,IF(C22=no,0,\"NA\")),\"NA\")","v":"NA"},{"$f":"D22/$F$4*$F$6","v":0.37209302325581395},{"$f":"IF(ISNUMBER(E22),E22/$F$4*$F$6,0)","v":0}]
["6.10",{"$f":"Languages!B124","v":"Doors directly to parking area"},null,7,{"$f":"IF(ISERROR(E24+E25+E26),\"NA\",SUM(E24:E26))","v":"NA"},{"$f":"D23/$F$4*$F$6","v":2.6046511627906979},{"$f":"IF(ISNUMBER(E23),E23/$F$4*$F$6,0)","v":0}]
[null,{"$f":"Languages!B125","v":"Width (<90 cm =0, >=90 cm = 2)"},null,null,{"$f":"IF(slcp=no,IF(C24=Options!B100,0,IF(C24=Options!B101,2,\"NA\")),\"NA\")","v":"NA"}]
[null,{"$f":"Languages!B126","v":"Emergency door, standard open (Yes=2, No= 0)"},null,null,{"$f":"IF(slcp=no,IF(C25=yes,2,IF(C25=no,0,\"NA\")),\"NA\")","v":"NA"}]
[null,{"$f":"Languages!B127","v":"Visibility (Glazed door/wall = 3, No Glass = 0)"},null,null,{"$f":"IF(slcp=no,IF(C26=Options!B103,3,IF(C26=Options!B104,0,\"NA\")),\"NA\")","v":"NA"}]
["6.11",{"$f":"Languages!B129","v":"Stairwells (visibility and orientation)"},null,2,{"$f":"IF(ISERROR(E28+E29),\"NA\",E28+E29)","v":"NA"},{"$f":"D27/$F$4*$F$6","v":0.7441860465116279},{"$f":"IF(ISNUMBER(E27),E27/$F$4*$F$6,0)","v":0}]
[null,{"$f":"Languages!B130","v":"Clear View (Yes = 1, No = 0, Irrelevant = 1)"},null,null,{"$f":"IF(NOT(OR(slcp=yes,emvc=yes)),IF(C28=yes,1,IF(C28=no,0,IF(C28=Options!B25,1,\"NA\"))),\"NA\")","v":"NA"}]
[null,{"$f":"Languages!B131","v":"Level Indication (Yes = 1, No = 0, Irrelevant = 1)"},null,null,{"$f":"IF(NOT(OR(slcp=yes,emvc=yes)),IF(C29=yes,1,IF(C29=no,0,IF(C29=Options!B25,1,\"NA\"))),\"NA\")","v":"NA"}]
["6.12",{"$f":"Languages!B132","v":"Stairs (incl. heightened visibility of steps)"},null,8,{"$f":"IF(ISERROR(E31+E32+E33+E34),\"NA\",SUM(E31:E34))","v":"NA"},{"$f":"D30/$F$4*$F$6","v":2.9767441860465116},{"$f":"IF(ISNUMBER(E30),E30/$F$4*$F$6,0)","v":0}]
[null,{"$f":"Languages!B133","v":"Width (< 1.5 m = 0, > 1.5m = 2)"},null,null,{"$f":"IF(NOT(OR(slcp=yes,emvc=yes)),IF(C31=Options!B97,0,IF(C31=Options!B98,2,\"NA\")),\"NA\")","v":"NA"}]
[null,{"$f":"Languages!B134","v":"Hand Rails (No hand rail =0, One Side = 1, Two sides=2)"},null,null,{"$f":"IF(NOT(OR(slcp=yes,emvc=yes)),IF(C32=Options!B106,0,IF(C32=Options!B107,1,IF(C32=Options!B108,2,\"NA\"))),\"NA\")","v":"NA"}]
[null,{"$f":"Languages!B135","v":"Heightened visibility of steps for people with poor eyesight (Yes = 2, No = 0)"},null,null,{"$f":"IF(NOT(OR(slcp=yes,emvc=yes)),IF(C33=yes,2,IF(C33=no,0,\"NA\")),\"NA\")","v":"NA"}]
[null,{"$f":"Languages!B136","v":"Anti-slip surfacing on stairs: (Yes = 2, No = 0)"},null,null,{"$f":"IF(NOT(OR(slcp=yes,emvc=yes)),IF(C34=yes,2,IF(C34=no,0,\"NA\")),\"NA\")","v":"NA"}]
["6.13",{"$f":"Languages!B137","v":"External openings in stairwell\r(window/grilled to outside or car park  =2, none =0)"},null,2,{"$f":"IF(NOT(OR(slcp=yes,emvc=yes)),IF(C35=Options!B110,2,IF(C35=Options!B111,0,\"NA\")),\"NA\")","v":"NA"},{"$f":"D35/$F$4*$F$6","v":0.7441860465116279},{"$f":"IF(ISNUMBER(E35),E35/$F$4*$F$6,0)","v":0}]
[null,{"$f":"CONCATENATE(Tags!$B$50,\" \",$B$1)","v":"Subtotals Pedestrian Access"},null,{"$f":"SUM(D12:D35)","v":43},{"$f":"SUM(E9,E11:E19,E22:E23,E27,E30,E35)","v":0},{"$f":"SUM(F12:F15,F16:F26,F27:F35)","v":15.999999999999998},{"$f":"SUM(G12:G35)","v":0}]
[]
[{"$f":"Tags!B60","v":"Notes"}]

{"sheet":"7. Security equipment","index":9,"n_rows":29,"n_cols":8,"rows_kept":29,"cut":false,"hidden":false,"merged":[[19,7,21,7],[2,7,5,7],[10,0,18,0],[10,3,18,3],[10,5,18,5],[10,6,18,6],[19,0,21,0],[19,3,21,3],[19,6,21,6],[19,5,21,5],[10,7,18,7]]}
[7,{"$f":"Languages!B138","v":"Security Equipment"},null,null,{"$f":"IF(C6>0,Tags!B21,Tags!B20)","v":"Incompleted"},"Points:",{"$f":"F5*F6","v":0},{"$f":"F5","v":0}]
[]
[null,{"$f":"Tags!B30","v":"Total Items"},8,null,{"$f":"Tags!B34","v":"Score"},{"$f":"E27","v":0},null,{"$f":"Evaluation!M12","v":"Incomplete"}]
[null,{"$f":"Tags!B31","v":"Total Items + SubItems"},16,null,{"$f":"Tags!B35","v":"Maximum Score"},{"$f":"D27","v":35}]
[null,{"$f":"Tags!B32","v":"Itens Completed"},{"$f":"COUNTA(C9:C10,C12:C19,C21:C26)","v":0},null,{"$f":"Tags!B36","v":"Percentage"},{"$f":"F3/F4","v":0}]
[null,{"$f":"Tags!B33","v":"Not measured"},{"$f":"C4-C5","v":16},null,{"$f":"Tags!B37","v":"Category Value"},{"$f":"VLOOKUP(A1,Evaluation!$A$7:$M$15,11)","v":8}]
[]
[7,{"$f":"Tags!B55","v":"Item List"},{"$f":"Tags!B56","v":"Measured value"},{"$f":"E4","v":"Maximum Score"},{"$f":"E3","v":"Score"},{"$f":"Tags!D57","v":"Maximum Contribuition for Final Score"},{"$f":"Tags!D58","v":"Contribuition for Final Score"},{"$f":"Tags!D59","v":"Remarks"}]
["7.1",{"$f":"Languages!B140","v":"CCTV with notice at entrance = 3, No CCTV =0"},null,3,{"$f":"IF(C9=yes,3,IF(C9=no,0,\"NA\"))","v":"NA"},{"$f":"D9/$F$4*$F$6","v":0.68571428571428572},{"$f":"IF(ISNUMBER(E9),E9/$F$4*$F$6,0)","v":0}]
["7.2",{"$f":"Languages!B141","v":"Staff surveillance (on-site or remote)\r•  Yes = 5, No = 0"},null,5,{"$f":"IF(C10=yes,5,IF(C10=no,0,\"NA\"))","v":"NA"},{"$f":"D10/$F$4*$F$6","v":1.1428571428571428},{"$f":"IF(ISNUMBER(E10),E10/$F$4*$F$6,0)","v":0}]
["7.3",{"$f":"Languages!B142","v":"CCTV at:"},null,10,{"$f":"IF(ISERROR(E12+E13+E14+E15+E16+E17+E18+E19),\"NA\",SUM(E12:E19))","v":"NA"},{"$f":"D11/$F$4*$F$6","v":2.2857142857142856},{"$f":"IF(ISNUMBER(E11),E11/$F$4*$F$6,0)","v":0}]
[null,{"$f":"Languages!B143","v":"Car Entry: Yes =1, No =0"},null,null,{"$f":"IF(C12=yes,1,IF(C12=no,0,\"NA\"))","v":"NA"}]
[null,{"$f":"Languages!B144","v":" Car Exit: Yes =1, No =0"},null,null,"NA"]
[null,{"$f":"Languages!B145","v":"Pay Machine: Yes =1, No =0"},null,null,"NA"]
[null,{"$f":"Languages!B146","v":"Elevator Hall, every level: Yes =1, No =0"},null,null,"NA"]
[null,{"$f":"Languages!B147","v":"Stairwells, every level: Yes =1, No =0"},null,null,"NA"]
[null,{"$f":"Languages!B148","v":"Pedestrian Entrances: Yes =1, No =0"},null,null,"NA"]
[null,{"$f":"Languages!B149","v":"Most of Parking Area (65%):Yes =3, No =0"},null,null,{"$f":"IF(C18=yes,3,IF(C18=no,0,\"NA\"))","v":"NA"}]
[null,{"$f":"Languages!B150","v":" Ramps: Yes = 1, No = 0"},null,null,{"$f":"IF(C19=yes,1,IF(C19=no,0,\"NA\"))","v":"NA"}]
["7.4",{"$f":"Languages!B151","v":"Staff contactable via:"},null,6,{"$f":"IF(ISERROR(E21+E22),\"NA\",SUM(E21:E22))","v":"NA"},{"$f":"D20/$F$4*$F$6","v":1.3714285714285714},{"$f":"IF(ISNUMBER(E20),E20/$F$4*$F$6,0)","v":0}]
[null,{"$f":"Languages!B152","v":"Intercom at pay machine and/or controlled entries (24/7=3, All access hours if not 24/7= 2, Part time/not available = 0)"},null,null,{"$f":"IF(C21=Options!B113,3,IF(C21=Options!B114,2,IF(C21=Options!B115,0,\"NA\")))","v":"NA"}]
[null,{"$f":"Languages!B153","v":"Emergency call system in parking area (24/7=3, All access hours if not 24/7= 2, Part time/not available = 0)"},null,null,{"$f":"IF(C22=Options!B113,3,IF(C22=Options!B114,2,IF(C22=Options!B115,0,\"NA\")))","v":"NA"}]
["7.5",{"$f":"Languages!B154","v":"Recognizable staff present and patrolling car park\r(24/7 = 3, During access Hours = 2, Less than access Hours = 1, No = 0)"},null,3,{"$f":"IF(C23=Options!B117,3,IF(C23=Options!B118,2,IF(C23=Options!B119,1,IF(C23=Options!B120,0,\"NA\"))))","v":"NA"},{"$f":"D23/$F$4*$F$6","v":0.68571428571428572},{"$f":"IF(ISNUMBER(E23),E23/$F$4*$F$6,0)","v":0}]
["7.6",{"$f":"Languages!B155","v":"Lockable vehicle exit/entry: \r(Closed gate/rolling shutter  after access hours = 2, Secured: fast opening gate during day = 4, Secured: slow opening gate during day = 2, No provisions = 0)"},null,4,{"$f":"IF(C24=Options!B122,2,IF(C24=Options!B123,4,IF(Options!B124=C24,2,IF(C24=Options!B125,0,\"NA\"))))","v":"NA"},0.91428571428571426,0]
["7.7",{"$f":"Languages!B156","v":"Lockable pedestrian exit/entry (after opening hours).\r(Door/gate/rolling shutter <= 15cm maximum aperture = 2, over 15 cm = 0, no provisions = 0, Irrelevant (24 hours opening) = 2)"},null,2,{"$f":"IF(C25=Options!B127,2,IF(OR(C25=Options!B128,C25=Options!B129),0,IF(Options!B130=C25,2,\"NA\")))","v":"NA"},0.45714285714285713,0]
["7.8",{"$f":"Languages!B157","v":"Grilles on external openings & security grilles\r(<= 15 cm = 2, > 15 cm or no protection= 0, Irrelevant (no external openings) = 2)"},null,2,{"$f":"IF(OR(C26=Options!B132,C26=Options!B134),2,IF(C26=Options!B133,0,\"NA\"))","v":"NA"},0.45714285714285713,0]
[null,{"$f":"CONCATENATE(Tags!$B$50,\" \",$B$1)","v":"Subtotals Security Equipment"},null,{"$f":"SUM(D9:D26)","v":35},{"$f":"SUM(E23:E26,E20,E9:E11)","v":0},{"$f":"SUM(F9:F26)","v":8},{"$f":"SUM(G9:G26)","v":0}]
[]
[{"$f":"Tags!B60","v":"Notes"}]

{"sheet":"8. Wayfinding","index":10,"n_rows":34,"n_cols":8,"rows_kept":34,"cut":false,"hidden":false,"merged":[[28,0,30,0],[28,3,30,3],[28,5,30,5],[28,6,30,6],[28,7,30,7],[2,7,5,7],[8,0,11,0],[8,3,11,3],[8,5,11,5],[8,6,11,6],[8,7,11,7],[20,0,22,0],[20,3,22,3],[20,5,22,5],[20,6,22,6],[20,7,22,7],[12,0,14,0],[12,3,14,3],[12,5,14,5],[12,6,14,6],[12,7,14,7],[23,0,26,0],[23,3,26,3],[23,5,26,5],[23,6,26,6],[23,7,26,7]]}
[8,{"$f":"Languages!B158","v":"Wayfinding Inside and Outside"},null,null,{"$f":"IF(C6>0,Tags!B21,Tags!B20)","v":"Incompleted"},"Points:",{"$f":"F5*F6","v":0},{"$f":"F5","v":0}]
[]
[null,{"$f":"Tags!B30","v":"Total Items"},11,null,{"$f":"Tags!B34","v":"Score"},{"$f":"E32","v":0},null,{"$f":"Evaluation!M13","v":"Incomplete"}]
[null,{"$f":"Tags!B31","v":"Total Items + SubItems"},18,null,{"$f":"Tags!B35","v":"Maximum Score"},{"$f":"D32","v":31}]
[null,{"$f":"Tags!B32","v":"Itens Completed"},{"$f":"COUNTA(C10:C12,C14:C20,C22:C23,C25:C28,C30:C31)","v":0},null,{"$f":"Tags!B36","v":"Percentage"},{"$f":"F3/F4","v":0}]
[null,{"$f":"Tags!B33","v":"Not measured"},{"$f":"C4-C5","v":18},null,{"$f":"Tags!B37","v":"Category Value"},{"$f":"VLOOKUP(A1,Evaluation!$A$7:$M$15,11)","v":8}]
[]
[8,{"$f":"Tags!B55","v":"Item List"},{"$f":"Tags!B56","v":"Measured value"},{"$f":"E4","v":"Maximum Score"},{"$f":"E3","v":"Score"},{"$f":"Tags!D57","v":"Maximum Contribuition for Final Score"},{"$f":"Tags!D58","v":"Contribuition for Final Score"},{"$f":"Tags!D59","v":"Remarks"}]
["8.1",{"$f":"Languages!B160","v":"Identification of vacant parking spaces"},null,5,{"$f":"IF(ISERROR(E10+E11+E12),\"NA\",SUM(E10:E12))","v":"NA"},{"$f":"D9/$F$4*$F$6","v":1.2903225806451613},{"$f":"IF(ISNUMBER(E9),E9/$F$4*$F$6,0)","v":0}]
[null,{"$f":"Languages!B161","v":"Parking floor level (yes/good = 2, no/bad = 0)"},null,null,{"$f":"IF(C10=Options!B136,2,IF(C10=Options!B137,0,\"NA\"))","v":"NA"}]
[null,{"$f":"Languages!B162","v":"Parking row (yes/good = 1, no/bad = 0)"},null,null,{"$f":"IF(C11=Options!B136,1,IF(C11=Options!B137,0,\"NA\"))","v":"NA"}]
[null,{"$f":"Languages!B163","v":"Individual stall indication (yes/good = 2, no/bad = 0)"},null,null,{"$f":"IF(C12=Options!B136,2,IF(C12=Options!B137,0,\"NA\"))","v":"NA"}]
["8.2",{"$f":"Languages!B164","v":"Way finding (vehicles)"},null,6,{"$f":"IF(ISERROR(E14+E15),\"NA\",SUM(E14:E15))","v":"NA"},{"$f":"D13/$F$4*$F$6","v":1.5483870967741935},{"$f":"IF(ISNUMBER(E13),E13/$F$4*$F$6,0)","v":0}]
[null,{"$f":"Languages!B165","v":"Are floors clearly and separately identified for drivers? (Good =3, Adequate =2, Poor =1, No =0)"},null,null,{"$f":"IF(C14=Options!B139,3,IF(C14=Options!B140,2,IF(C14=Options!B141,1,IF(C14=Options!B142,0,\"NA\"))))","v":"NA"}]
[null,{"$f":"Languages!B166","v":"Are sub-areas of floors clearly identified for drivers? (Good =3, Adequate =2, Poor =1, No =0)"},null,null,{"$f":"IF(C15=Options!B139,3,IF(C15=Options!B140,2,IF(C15=Options!B141,1,IF(C15=Options!B142,0,\"NA\"))))","v":"NA"}]
["8.3",{"$f":"Languages!B167","v":"Are fire escapes and escape routes clearly marked\r• Clear from all locations = 3\r• most locations= 2\r• some locations=1\r• No marking of escape routes=0)"},null,3,{"$f":"IF(C16=Options!B144,3,IF(C16=Options!B145,2,IF(C16=Options!B146,1,IF(C16=Options!B147,0,\"NA\"))))","v":"NA"},{"$f":"D16/$F$4*$F$6","v":0.77419354838709675},{"$f":"IF(ISNUMBER(E16),E16/$F$4*$F$6,0)","v":0}]
["8.4",{"$f":"Languages!B168","v":"Are floor levels clearly marked?\r(good =3, adequate=2, poor=1, none =0. Single level car parks = 3)"},null,3,{"$f":"IF(C17=Options!B153,3,IF(C17=Options!B149,3,IF(C17=Options!B150,2,IF(C17=Options!B151,1,IF(C17=Options!B152,0,\"NA\")))))","v":"NA"},{"$f":"D17/$F$4*$F$6","v":0.77419354838709675},0]
["8.5",{"$f":"Languages!B169","v":"Is there additional signing or prompts to orient the pedestrian on the parking deck\r(good =2, some =1, none = 0)"},null,2,{"$f":"IF(C18=Options!B155,2,IF(C18=Options!B156,1,IF(C18=Options!B157,0,\"NA\")))","v":"NA"},0.5161290322580645,0]
["8.6",{"$f":"Languages!B170","v":"Are parking spaces individually numbered\r(Numbered including floor identification =2, Just numbers =1, none =0)"},null,2,{"$f":"IF(C19=Options!B159,2,IF(C19=Options!B160,1,IF(C19=Options!B161,0,\"NA\")))","v":"NA"},0.5161290322580645,0]
["8.7",{"$f":"Languages!B171","v":"Use of colours for  way finding\r(Yes= 1, No= 0)"},null,1,{"$f":"IF(C20=yes,1,IF(C20=no,0,\"NA\"))","v":"NA"},0.25806451612903225,0]
["8.8",{"$f":"Languages!B172","v":"Guidance sign posting for cars on roads to car park"},null,2,{"$f":"IF(ISERROR(E22+E23),\"NA\",SUM(E22:E23))","v":"NA"},{"$f":"D21/$F$4*$F$6","v":0.5161290322580645},0]
[null,{"$f":"Languages!B173","v":"Static sign system only (Yes = 1, No = 0)"},null,null,{"$f":"IF(C22=yes,1,IF(C22=no,0,\"NA\"))","v":"NA"}]
[null,{"$f":"Languages!B174","v":"Dynamic sign system additionally (Yes = 1, No = 0)"},null,null,{"$f":"IF(C23=yes,1,IF(C23=no,0,\"NA\"))","v":"NA"}]
["8.9",{"$f":"Languages!B175","v":"Illuminated signage at car park entrance"},null,3,{"$f":"IF(ISERROR(E25+E26+E27),\"NA\",SUM(E25:E27))","v":"NA"},{"$f":"D24/$F$4*$F$6","v":0.77419354838709675},{"$f":"IF(ISNUMBER(E24),E24/$F$4*$F$6,0)","v":0}]
[null,{"$f":"Languages!B176","v":"Signal green arrow, red cross for direction (Yes = 1, No = 0)"},null,null,{"$f":"IF(C25=yes,1,IF(C25=no,0,\"NA\"))","v":"NA"}]
[null,{"$f":"Languages!B177","v":"Signal full/free (Yes = 1, No = 0)"},null,null,{"$f":"IF(C26=yes,1,IF(C26=no,0,\"NA\"))","v":"NA"}]
[null,{"$f":"Languages!B178","v":"Signage at pedestrian entrance (Yes = 1, No = 0)"},null,null,{"$f":"IF(C27=yes,1,IF(C27=no,0,\"NA\"))","v":"NA"}]
["8.10",{"$f":"Languages!B111","v":"City plan a central location in car park:\r(On Every pedestrian exit = 2, One location = 1, No = 0)"},null,2,{"$f":"IF(C28=Options!B82,2,IF(C28=Options!B83,1,IF(C28=Options!B84,0,\"NA\")))","v":"NA"},{"$f":"D28/$F$4*$F$6","v":0.5161290322580645},{"$f":"IF(ISNUMBER(E28),E28/$F$4*$F$6,0)","v":0}]
["8.11",{"$f":"Languages!B112","v":"Guidance:"},null,2,{"$f":"IF(ISERROR(E30+E31),\"NA\",SUM(E30:E31))","v":"NA"},{"$f":"D28/$F$4*$F$6","v":0.5161290322580645},{"$f":"IF(ISNUMBER(E29),E29/$F$4*$F$6,0)","v":0}]
[null,{"$f":"Languages!B113","v":"to key attractions around the car park at pedestrian exit (Yes=1, No=0):"},null,null,{"$f":"IF(C30=yes,1,IF(C30=no,0,\"NA\"))","v":"NA"}]
[null,{"$f":"Languages!B114","v":"around the car park to pedestrian entrances (Yes=1, No=0):"},null,null,{"$f":"IF(C31=yes,1,IF(C31=no,0,\"NA\"))","v":"NA"}]
[null,{"$f":"CONCATENATE(Tags!$B$50,\" \",$B$1)","v":"Subtotals Wayfinding Inside and Outside"},null,{"$f":"SUM(D9:D31)","v":31},{"$f":"SUM(E24,E16:E21,E13,E9,E28,E29)","v":0},{"$f":"SUM(F9:F31)","v":8},{"$f":"SUM(G9:G31)","v":0}]
[]
[{"$f":"Tags!B60","v":"Notes"}]

{"sheet":"9. Comfort","index":11,"n_rows":45,"n_cols":8,"rows_kept":45,"cut":false,"hidden":false,"merged":[[2,7,5,7],[8,0,11,0],[8,3,11,3],[8,5,11,5],[8,6,11,6],[8,7,11,7],[25,0,29,0],[25,3,29,3],[25,6,29,6],[25,7,29,7],[25,5,29,5],[12,0,20,0],[12,3,20,3],[12,5,20,5],[12,6,20,6],[12,7,20,7],[30,0,32,0],[30,3,32,3],[30,5,32,5],[30,6,32,6],[30,7,32,7],[22,3,24,3],[22,0,24,0],[22,6,24,6],[22,7,24,7],[22,5,24,5],[39,0,41,0],[39,3,41,3],[39,5,41,5],[39,6,41,6],[39,7,41,7],[33,0,36,0],[33,3,36,3],[33,5,36,5],[33,6,36,6],[33,7,36,7]]}
[9,{"$f":"Languages!B179","v":"Comfort and Miscellaneous"},null,null,{"$f":"IF(C6>0,Tags!B21,Tags!B20)","v":"Incompleted"},"Points:",{"$f":"F5*F6","v":0},{"$f":"F5","v":0}]
[]
[null,{"$f":"Tags!B30","v":"Total Items"},10,null,{"$f":"Tags!B34","v":"Score"},{"$f":"E43","v":0},null,{"$f":"Evaluation!M14","v":"Incomplete"}]
[null,{"$f":"Tags!B31","v":"Total Items + SubItems"},{"$f":"27-IF(C27=no,3,0)-IF(C41=no,1,0)","v":27},null,{"$f":"Tags!B35","v":"Maximum Score"},{"$f":"D43","v":34}]
[null,{"$f":"Tags!B32","v":"Itens Completed"},{"$f":"COUNTA(C10:C12,C14:C23,C32:C33,C35:C39)+IF(C23=yes,COUNTA(C25),COUNTA(C24))+IF(C27=yes,COUNTA(C27:C30),COUNTA(C27))+IF(C41=no,COUNTA(C41),COUNTA(C41:C42))","v":0},null,{"$f":"Tags!B36","v":"Percentage"},{"$f":"F3/F4","v":0}]
[null,{"$f":"Tags!B33","v":"Not measured"},{"$f":"C4-C5","v":27},null,{"$f":"Tags!B37","v":"Category Value"},{"$f":"VLOOKUP(A1,Evaluation!$A$7:$M$15,11)","v":8}]
[]
[9,{"$f":"Tags!B55","v":"Item List"},{"$f":"Tags!B56","v":"Measured value"},{"$f":"E4","v":"Maximum Score"},{"$f":"E3","v":"Score"},{"$f":"Tags!D57","v":"Maximum Contribuition for Final Score"},{"$f":"Tags!D58","v":"Contribuition for Final Score"},{"$f":"Tags!D59","v":"Remarks"}]
["9.1",{"$f":"Languages!B180","v":"Notice-board at pedestrian entrance/exit showing:"},null,3,{"$f":"IF(ISERROR(SUM(E10:E12)),\"NA\",SUM(E10:E12))","v":0},{"$f":"D9/$F$4*$F$6","v":0.70588235294117652},{"$f":"IF(ISNUMBER(E9),E9/$F$4*$F$6,0)","v":0}]
[null,{"$f":"Languages!B181","v":"Access hours normal/special (yes = 1, no = 0)"},null,null,{"$f":"IF(C10=yes,1,IF(C10=no,0,\"NA\"))","v":"NA"}]
[null,{"$f":"Languages!B182","v":"Readable & understandable tariff board (yes = 1, no = 0)"},null,null,{"$f":"IF(C11=yes,1,IF(C11=no,0,\"NA\"))","v":"NA"}]
[null,{"$f":"Languages!B183","v":"Operators terms and conditions (yes = 1, no = 0)"},null,null,{"$f":"IF(C12=yes,1,IF(C12=no,0,\"NA\"))","v":"NA"}]
["9.2",{"$f":"Languages!B184","v":"Payment options (pay at exit/pay at pay station):"},null,10,{"$f":"IF(ISERROR(SUM(E14:E21)),\"NA\",SUM(E14:E21))","v":0},{"$f":"D13/$F$4*$F$6","v":2.3529411764705883},{"$f":"IF(ISNUMBER(E13),E13/$F$4*$F$6,0)","v":0}]
[null,{"$f":"Languages!B185","v":"Accepts coins? (yes =1, no =0)"},null,null,{"$f":"IF(C14=yes,1,IF(C14=no,0,\"NA\"))","v":"NA"}]
[null,{"$f":"Languages!B186","v":"Change given? (yes =1, no =0)"},null,null,"NA"]
[null,{"$f":"Languages!B187","v":"Accepts banknotes?  (yes =1, no =0)"},null,null,"NA"]
[null,{"$f":"Languages!B188","v":"Accepts bank cards?  (yes =1, no =0)"},null,null,"NA"]
[null,{"$f":"Languages!B189","v":"Payment by smart phone? (yes =1, no =0)"},null,null,"NA"]
[null,{"$f":"Languages!B190","v":"Payment by card/phone at exit? (yes =1, no =0)"},null,null,"NA"]
[null,{"$f":"Languages!B191","v":"ID & payment by LPR? (yes =1, no =0)"},null,null,"NA"]
[null,{"$f":"Languages!B192","v":"Accepts other cards: How many? (1 point per additional option up to 3)"},null,null,{"$f":"IF(C21=Options!B163,0,IF(C21=Options!B164,1,IF(C21=Options!B165,2,IF(C21=Options!B166,3,\"NA\"))))","v":"NA"}]
["9.3",{"$f":"Languages!B193","v":"Payment at staffed desk: (yes = 1, no = 0)"},null,1,{"$f":"IF(C22=yes,1,IF(C22=no,0,\"NA\"))","v":"NA"},{"$f":"D22/$F$4*$F$6","v":0.23529411764705882},{"$f":"IF(ISNUMBER(E22),E22/$F$4*$F$6,0)","v":0}]
["9.4",{"$f":"Languages!B194","v":"Is this a Pay and Display Car Park?"},null,3,{"$f":"IF(C23=yes,E25,E24)","v":"NA"},{"$f":"D23/$F$4*$F$6","v":0.70588235294117652},{"$f":"IF(ISNUMBER(E23),E23/$F$4*$F$6,0)","v":0}]
[null,{"$f":"Languages!B195","v":"Number of Pay points for Barrier controlled car parks:\r(One pay station = 0,  More than one =1, One at each pedestrian entrance, excluding fire escapes =2, More than one at each pedestrian entrance =3)"},null,null,{"$f":"IF(C23<>yes,IF(C24=Options!B168,0,IF(C24=Options!B169,1,IF(C24=Options!B170,2,IF(Options!B171=C24,3,\"NA\")))),\"NA\")","v":"NA"}]
[null,{"$f":"Languages!B196","v":"Number of Pay points for Pay and Display Car Parks\r(One =0, < 1 for every 50 spaces =2, >1 for every 50 spaces =3)"},null,null,{"$f":"IF(C23=yes,IF(C25=Options!B173,0,IF(C25=Options!B174,1,IF(C25=Options!B175,3,\"NA\"))),\"NA\")","v":"NA"}]
["9.5",{"$f":"Languages!B197","v":"Customer toilets:"},null,5,{"$f":"IF(ISERROR(SUM(E27:E30)),\"NA\",SUM(E27:E30))","v":0},{"$f":"D26/$F$4*$F$6","v":1.1764705882352942},{"$f":"IF(ISNUMBER(E26),E26/$F$4*$F$6,0)","v":0}]
[null,{"$f":"Languages!B198","v":"Exist? (yes= 2, no= 0)"},null,null,{"$f":"IF(C27=yes,2,IF(C27=no,0,\"NA\"))","v":"NA"}]
[null,{"$f":"Languages!B199","v":"Disabled toilet? (yes=1, no= 0)"},null,null,{"$f":"IF(C27=yes,IF(C28=yes,1,IF(C28=no,0,\"NA\")),\"NA\")","v":"NA"}]
[null,{"$f":"Languages!B200","v":"unisex = 0, male/female separated = 1"},null,null,{"$f":"IF(C27=yes,IF(C29=Options!B177,0,IF(C29=Options!B178,1,\"NA\")),\"NA\")","v":"NA"}]
[null,{"$f":"Languages!B201","v":"attendant: yes=1, no= 0"},null,null,{"$f":"IF(C27=yes,IF(C30=yes,1,IF(C30=no,0,\"NA\")),\"NA\")","v":"NA"}]
["9.6",{"$f":"Languages!B202","v":"Use of colours/ embellishing works"},null,2,{"$f":"IF(ISERROR(SUM(E32:E33)),\"NA\",SUM(E32:E33))","v":0},{"$f":"D31/$F$4*$F$6","v":0.47058823529411764},{"$f":"IF(ISNUMBER(E31),E31/$F$4*$F$6,0)","v":0}]
[null,{"$f":"Languages!B203","v":"Coloured pillars =1, no/concrete grey = 0"},null,null,{"$f":"IF(C32=Options!B180,1,IF(C32=Options!B181,0,\"NA\"))","v":"NA"}]
[null,{"$f":"Languages!B204","v":"Coloured walls =1, no/concrete grey = 0"},null,null,{"$f":"IF(C33=Options!B183,1,IF(C33=Options!B184,0,\"NA\"))","v":"NA"}]
["9.7",{"$f":"Languages!B205","v":"Extra embellishment"},null,4,{"$f":"IF(ISERROR(SUM(E35:E37)),\"NA\",SUM(E35:E37))","v":0},{"$f":"D34/$F$4*$F$6","v":0.94117647058823528},{"$f":"IF(ISNUMBER(E34),E34/$F$4*$F$6,0)","v":0}]
[null,{"$f":"Languages!B206","v":" Artwork: (Yes = 2, No = 0)"},null,null,{"$f":"IF(C35=yes,2,IF(C35=no,0,\"NA\"))","v":"NA"}]
[null,{"$f":"Languages!B207","v":"Planters: (Yes = 1, No = 0)"},null,null,{"$f":"IF(C36=yes,1,IF(C36=no,0,\"NA\"))","v":"NA"}]
[null,{"$f":"Languages!B208","v":"Other: (Yes = 1, No = 0)"},null,null,{"$f":"IF(C37=yes,1,IF(C37=no,0,\"NA\"))","v":"NA"}]
["9.8",{"$f":"Languages!B209","v":"Mobile phone coverage (Yes = 2, No = 0)"},null,2,{"$f":"IF(C38=yes,2,IF(C38=no,0,\"NA\"))","v":"NA"},{"$f":"D38/$F$4*$F$6","v":0.47058823529411764},{"$f":"IF(ISNUMBER(E38),E38/$F$4*$F$6,0)","v":0}]
["9.9",{"$f":"Languages!B210","v":"Continuity of radio signals (Yes = 1, No = 0)"},null,1,{"$f":"IF(C39=yes,1,IF(C39=no,0,\"NA\"))","v":"NA"},0.23529411764705882,{"$f":"IF(ISNUMBER(E39),E39/$F$4*$F$6,0)","v":0}]
["9.10",{"$f":"Languages!B211","v":"Music"},null,3,{"$f":"IF(ISERROR(SUM(E41:E42)),\"NA\",SUM(E41:E42))","v":0},{"$f":"D40/$F$4*$F$6","v":0.70588235294117652},{"$f":"IF(ISNUMBER(E40),E40/$F$4*$F$6,0)","v":0}]
[null,{"$f":"Languages!B212","v":"Background music: yes = 2, No = 0"},null,null,{"$f":"IF(C41=yes,2,IF(C41=no,0,\"NA\"))","v":"NA"}]
[null,{"$f":"Languages!B213","v":"Differentiation for way finding :  yes =1, No = 0"},null,null,{"$f":"IF(C41=yes,IF(C42=yes,1,0),\"NA\")","v":"NA"}]
[null,{"$f":"CONCATENATE(Tags!$B$50,\" \",$B$1)","v":"Subtotals Comfort and Miscellaneous"},null,{"$f":"SUM(D9:D40)","v":34},{"$f":"SUM(E38:E40,E34,E31,E26,E23,E22,E13,E9)","v":0},{"$f":"SUM(F9:F42)","v":8},{"$f":"SUM(G9:G42)","v":0}]
[]
[{"$f":"Tags!B60","v":"Notes"}]

{"sheet":"10. Energy Environment","index":12,"n_rows":23,"n_cols":8,"rows_kept":23,"cut":false,"hidden":false,"merged":[[2,7,5,7],[8,0,10,0],[8,3,10,3],[8,5,10,5],[8,6,10,6],[8,7,10,7]]}
[10,{"$f":"Languages!B214","v":"Energy and Environment"},null,null,{"$f":"IF(C6>0,Tags!B21,Tags!B20)","v":"Incompleted"},"Points:",{"$f":"F5*F6","v":0},{"$f":"F5","v":0}]
[]
[null,{"$f":"Tags!B30","v":"Total Items"},10,null,{"$f":"Tags!B34","v":"Score"},{"$f":"E21","v":0},null,{"$f":"Evaluation!M15","v":"Incomplete"}]
[null,{"$f":"Tags!B31","v":"Total Items + SubItems"},11,null,{"$f":"Tags!B35","v":"Maximum Score"},{"$f":"D21","v":20}]
[null,{"$f":"Tags!B32","v":"Itens Completed"},{"$f":"COUNTA(C10:C20)","v":0},null,{"$f":"Tags!B36","v":"Percentage"},{"$f":"F3/F4","v":0}]
[null,{"$f":"Tags!B33","v":"Not measured"},{"$f":"C4-C5","v":11},null,{"$f":"Tags!B37","v":"Category Value"},{"$f":"VLOOKUP(A1,Evaluation!$A$7:$M$15,11)","v":8}]
[]
[10,{"$f":"Tags!B55","v":"Item List"},{"$f":"Tags!B56","v":"Measured value"},{"$f":"E4","v":"Maximum Score"},{"$f":"E3","v":"Score"},{"$f":"Tags!D57","v":"Maximum Contribuition for Final Score"},{"$f":"Tags!D58","v":"Contribuition for Final Score"},{"$f":"Tags!D59","v":"Remarks"}]
["10.1",{"$f":"Languages!B215","v":"Energy Saving Lighting Systems"},null,2,{"$f":"IF(ISERROR(E10+E11),\"NA\",SUM(E10:E11))","v":"NA"},{"$f":"D9/$F$4*$F$6","v":0.8},{"$f":"IF(ISNUMBER(E9),E9/$F$4*$F$6,0)","v":0}]
[null,{"$f":"Languages!B216","v":"Power Factor Compensation (Yes=1, No=0)"},null,null,{"$f":"IF(C10=yes,1,IF(C10=no,0,\"NA\"))","v":"NA"}]
[null,{"$f":"Languages!B217","v":"Other Systems (Yes=1, No=0)"},null,null,{"$f":"IF(C11=yes,1,IF(C11=no,0,\"NA\"))","v":"NA"}]
["10.2",{"$f":"Languages!B218","v":"Movement detection variable lights, remaining quality (yes= 2, no= 0)"},null,2,{"$f":"IF(C12=yes,2,IF(C12=no,0,\"NA\"))","v":"NA"},{"$f":"D12/$F$4*$F$6","v":0.8},{"$f":"IF(ISNUMBER(E12),E12/$F$4*$F$6,0)","v":0}]
["10.3",{"$f":"Languages!B219","v":"Adaptable lighting for daylight compensation at entrance area \r(yes= 2, no= 0)"},null,2,{"$f":"IF(C13=yes,2,IF(C13=no,0,\"NA\"))","v":"NA"},0.8,0]
["10.4",{"$f":"Languages!B220","v":"Adaptable lighting for ambient light conditions at parking floor from daylight\r(yes= 2, no= 0, Irrelevant (below ground) =2)"},null,2,{"$f":"IF(C14=yes,2,IF(C14=no,0,IF(C14=Options!B25,2,\"NA\")))","v":"NA"},0.8,0]
["10.5",{"$f":"Languages!B221","v":"Solar panels on the roof or other green energy initiatives (yes= 2, no= 0)"},null,2,{"$f":"IF(C15=yes,2,IF(C15=no,0,\"NA\"))","v":"NA"},0.8,0]
["10.6",{"$f":"Languages!B222","v":"Special treatment of cleaning water:\r•  yes= 2, no= 0"},null,2,{"$f":"IF(C16=yes,2,IF(C16=no,0,\"NA\"))","v":"NA"},0.8,0]
["10.7",{"$f":"Languages!B223","v":"Grey water or re-use of rain water\r•  yes= 2, no= 0\r"},null,2,{"$f":"IF(C17=yes,2,IF(C17=no,0,\"NA\"))","v":"NA"},0.8,0]
["10.8",{"$f":"Languages!B224","v":"Electric Vehicles recharging points: (Yes, more than one= 2, One recharging point=1, None=0)"},null,2,{"$f":"IF(C18=Options!B186,2,IF(C18=Options!B187,1,IF(C18=Options!B188,0,\"NA\")))","v":"NA"},0.8,0]
["10.9",{"$f":"Languages!B225","v":"Car sharing and similar initiatives\r•  yes= 2, no= 0"},null,2,{"$f":"IF(C19=yes,2,IF(C19=no,0,\"NA\"))","v":"NA"},0.8,0]
["10.10",{"$f":"Languages!B226","v":"Other environmental or zero emission  initiatives\r•  yes= 2, no= 0"},null,2,{"$f":"IF(C20=yes,2,IF(C20=no,0,\"NA\"))","v":"NA"},0.8,0]
[null,{"$f":"CONCATENATE(Tags!$B$50,\" \",$B$1)","v":"Subtotals Energy and Environment"},null,{"$f":"SUM(D9:D20)","v":20},{"$f":"SUM(E12:E20,E9)","v":0},{"$f":"SUM(F9:F20)","v":7.9999999999999991},{"$f":"SUM(G9:G20)","v":0}]
[]
[{"$f":"Tags!B60","v":"Notes"}]

{"sheet":"Minus","index":13,"n_rows":39,"n_cols":8,"rows_kept":39,"cut":false,"hidden":false,"merged":[[20,7,24,7],[8,7,13,7],[14,0,19,0],[14,3,19,3],[14,5,19,5],[14,6,19,6],[14,7,19,7],[8,0,13,0],[8,3,13,3],[8,5,13,5],[8,6,13,6],[20,0,24,0],[20,3,24,3],[20,5,24,5],[20,6,24,6],[29,0,32,0],[29,3,32,3],[29,5,32,5],[29,6,32,6],[29,7,32,7],[25,0,28,0],[25,3,28,3],[25,5,28,5],[25,6,28,6],[25,7,28,7]]}
["M",{"$f":"Languages!B227","v":"Minus Points"},null,null,{"$f":"IF(C6>0,Tags!B21,Tags!B20)","v":"Incompleted"},"Points:",{"$f":"F5*F6","v":0},{"$f":"F5","v":0}]
[]
[null,{"$f":"Tags!B30","v":"Total Items"},8,null,{"$f":"Tags!B34","v":"Score"},{"$f":"E37","v":0}]
[null,{"$f":"Tags!B31","v":"Total Items + SubItems"},23,null,{"$f":"Tags!B35","v":"Maximum Score"},{"$f":"D37","v":-60}]
[null,{"$f":"Tags!B32","v":"Itens Completed"},{"$f":"COUNTA(C10:C14,C16:C20,C22:C25,C27:C29,C31:C36)","v":0},null,{"$f":"Tags!B36","v":"Percentage"},{"$f":"F3/F4","v":0}]
[null,{"$f":"Tags!B33","v":"Not measured"},{"$f":"C4-C5","v":23},null,{"$f":"Tags!B37","v":"Category Value"},{"$f":"Evaluation!K18","v":-15}]
[]
["M",{"$f":"Tags!B55","v":"Item List"},{"$f":"Tags!B56","v":"Measured value"},{"$f":"E4","v":"Maximum Score"},{"$f":"E3","v":"Score"},{"$f":"Tags!D57","v":"Maximum Contribuition for Final Score"},{"$f":"Tags!D58","v":"Contribuition for Final Score"},{"$f":"Tags!D59","v":"Remarks"}]
["M.1",{"$f":"Languages!B228","v":"Presence of Graffiti"},null,-10,{"$f":"IF(ISERROR(E10+E11+E12+E13+E14),\"NA\",SUM(E10:E14))","v":"NA"},{"$f":"D9/$F$4*$F$6","v":-2.5},{"$f":"IF(ISNUMBER(E9),E9/$F$4*$F$6,0)","v":0}]
[null,{"$f":"Languages!B229","v":"Stairwells (Yes= -2, No= 0)"},null,null,{"$f":"IF(C10=yes,-2,IF(C10=no,0,\"NA\"))","v":"NA"}]
[null,{"$f":"Languages!B230","v":"Elevator (Yes= -2, No= 0)"},null,null,{"$f":"IF(C11=yes,-2,IF(C11=no,0,\"NA\"))","v":"NA"}]
[null,{"$f":"Languages!B231","v":"Toilets (Yes= -2, No= 0)"},null,null,{"$f":"IF(C12=yes,-2,IF(C12=no,0,\"NA\"))","v":"NA"}]
[null,{"$f":"Languages!B232","v":"Parking area (Yes= -2, No= 0)"},null,null,{"$f":"IF(C13=yes,-2,IF(C13=no,0,\"NA\"))","v":"NA"}]
[null,{"$f":"Languages!B233","v":"Outside walls (Yes= -2, No= 0)"},null,null,{"$f":"IF(C14=yes,-2,IF(C14=no,0,\"NA\"))","v":"NA"}]
["M.2",{"$f":"Languages!B234","v":"Presence of dirt"},null,-10,{"$f":"IF(ISERROR(E16+E17+E18+E19+E20),\"NA\",SUM(E16:E20))","v":"NA"},{"$f":"D15/$F$4*$F$6","v":-2.5},{"$f":"IF(ISNUMBER(E15),E15/$F$4*$F$6,0)","v":0}]
[null,{"$f":"Languages!B235","v":"Stairwells (Yes= -2, No= 0)"},null,null,{"$f":"IF(C16=yes,-2,IF(C16=no,0,\"NA\"))","v":"NA"}]
[null,{"$f":"Languages!B236","v":"Elevator (Yes= -2, No= 0)"},null,null,{"$f":"IF(C17=yes,-2,IF(C17=no,0,\"NA\"))","v":"NA"}]
[null,{"$f":"Languages!B237","v":"Toilets (Yes= -2, No= 0)"},null,null,{"$f":"IF(C18=yes,-2,IF(C18=no,0,\"NA\"))","v":"NA"}]
[null,{"$f":"Languages!B238","v":"Parking area (Yes= -2, No= 0)"},null,null,{"$f":"IF(C19=yes,-2,IF(C19=no,0,\"NA\"))","v":"NA"}]
[null,{"$f":"Languages!B239","v":"Outside of entrance for pedestrians + cars (Yes= -2, No= 0)"},null,null,{"$f":"IF(C20=yes,-2,IF(C20=no,0,\"NA\"))","v":"NA"}]
["M.3",{"$f":"Languages!B240","v":"Poor quality of paint work"},null,-8,{"$f":"IF(ISERROR(E22+E23+E24+E25),\"NA\",SUM(E22:E25))","v":"NA"},{"$f":"D21/$F$4*$F$6","v":-2},{"$f":"IF(ISNUMBER(E21),E21/$F$4*$F$6,0)","v":0}]
[null,{"$f":"Languages!B241","v":"Stairwells (Yes= -2, No= 0)"},null,null,{"$f":"IF(C22=yes,-2,IF(C22=no,0,\"NA\"))","v":"NA"}]
[null,{"$f":"Languages!B242","v":"Elevator (Yes= -2, No= 0)"},null,null,{"$f":"IF(C23=yes,-2,IF(C23=no,0,\"NA\"))","v":"NA"}]
[null,{"$f":"Languages!B243","v":"Parking area (Yes= -2, No= 0)"},null,null,{"$f":"IF(C24=yes,-2,IF(C24=no,0,\"NA\"))","v":"NA"}]
[null,{"$f":"Languages!B244","v":"Poor quality horizontal markings (Yes= -2, No= 0)"},null,null,{"$f":"IF(C25=yes,-2,IF(C25=no,0,\"NA\"))","v":"NA"}]
["M.4",{"$f":"Languages!B245","v":"Poor quality/lack of maintenance (pot holes ,damages) "},null,-6,{"$f":"IF(ISERROR(E27+E28+E29),\"NA\",SUM(E27:E29))","v":"NA"},{"$f":"D26/$F$4*$F$6","v":-1.5},{"$f":"IF(ISNUMBER(E26),E26/$F$4*$F$6,0)","v":0}]
[null,{"$f":"Languages!B246","v":"Floors (Yes= -2, No= 0)"},null,null,{"$f":"IF(C27=yes,-2,IF(C27=no,0,\"NA\"))","v":"NA"}]
[null,{"$f":"Languages!B247","v":"Walls (Yes= -2, No= 0)"},null,null,{"$f":"IF(C28=yes,-2,IF(C28=no,0,\"NA\"))","v":"NA"}]
[null,{"$f":"Languages!B248","v":"Evidence of standing water (Yes= -2, No= 0)"},null,null,{"$f":"IF(C29=yes,-2,IF(C29=no,0,\"NA\"))","v":"NA"}]
["M.5",{"$f":"Languages!B249","v":"Evidence of bad smells"},null,-6,{"$f":"IF(ISERROR(E31+E32+E33),\"NA\",SUM(E31:E33))","v":"NA"},{"$f":"D30/$F$4*$F$6","v":-1.5},{"$f":"IF(ISNUMBER(E30),E30/$F$4*$F$6,0)","v":0}]
[null,{"$f":"Languages!B250","v":"Elevators (Yes= -2, No= 0)"},null,null,{"$f":"IF(C31=yes,-2,IF(C31=no,0,\"NA\"))","v":"NA"}]
[null,{"$f":"Languages!B251","v":"Stairwells (Yes= -2, No= 0)"},null,null,{"$f":"IF(C32=yes,-2,IF(C32=no,0,\"NA\"))","v":"NA"}]
[null,{"$f":"Languages!B252","v":"Parking deck (Yes= -2, No= 0)"},null,null,{"$f":"IF(C33=yes,-2,IF(C33=no,0,\"NA\"))","v":"NA"}]
["M.6",{"$f":"Languages!B253","v":"Over 15% of parking spaces in cul-de-sac without occupancy indication. (Yes= -5, No=0)"},null,-5,{"$f":"IF(C34=yes,-5,IF(C34=no,0,\"NA\"))","v":"NA"},{"$f":"D34/$F$4*$F$6","v":-1.25},{"$f":"IF(ISNUMBER(E34),E34/$F$4*$F$6,0)","v":0}]
["M.7",{"$f":"Languages!B254","v":"Various points of criticism (to explain!)\r[E.g. hollow sound, squeaking tyres, unintended visitors, etc.] up to -10"},null,-10,{"$f":"IF(ISNUMBER(C35),C35,\"NA\")","v":"NA"},{"$f":"D35/$F$4*$F$6","v":-2.5},{"$f":"IF(ISNUMBER(E35),E35/$F$4*$F$6,0)","v":0}]
["M.8",{"$f":"Languages!B255","v":"Penalty for Mandatory Condition 1.4 Applies"},null,-5,{"$f":"IF(C36=yes,-5,IF(C36=no,0,\"NA\"))","v":"NA"},{"$f":"D36/$F$4*$F$6","v":-1.25},{"$f":"IF(ISNUMBER(E36),E36/$F$4*$F$6,0)","v":0}]
[null,{"$f":"CONCATENATE(Tags!$B$50,\" \",$B$1)","v":"Subtotals Minus Points"},null,{"$f":"SUM(D9:D36)","v":-60},{"$f":"SUM(E34:E35,E30,E26,E21,E15,E9)","v":0},{"$f":"SUM(F9:F35)","v":-13.75},{"$f":"SUM(G9:G35)","v":0}]
[]
[{"$f":"Tags!B60","v":"Notes"}]

{"sheet":"Bonus","index":14,"n_rows":28,"n_cols":8,"rows_kept":28,"cut":false,"hidden":false,"merged":[[8,0,18,0],[8,7,18,7],[8,6,18,6],[8,5,18,5],[8,3,18,3]]}
["B","Bonus Points",null,null,{"$f":"IF(C6>0,Tags!B21,Tags!B20)","v":"Incompleted"},"Points:",{"$f":"F5*F6","v":0},{"$f":"F5","v":0}]
[]
[null,{"$f":"Tags!B30","v":"Total Items"},7,null,{"$f":"Tags!B34","v":"Score"},{"$f":"E26","v":0}]
[null,{"$f":"Tags!B31","v":"Total Items + SubItems"},16,null,{"$f":"Tags!B35","v":"Maximum Score"},{"$f":"D26","v":33}]
[null,{"$f":"Tags!B32","v":"Itens Completed"},{"$f":"COUNTA(C10:C25)","v":0},null,{"$f":"Tags!B36","v":"Percentage"},{"$f":"F3/F4","v":0}]
[null,{"$f":"Tags!B33","v":"Not measured"},{"$f":"C4-C5","v":16},null,{"$f":"Tags!B37","v":"Category Value"},{"$f":"Evaluation!K19","v":15}]
[]
["B",{"$f":"Tags!B55","v":"Item List"},{"$f":"Tags!B56","v":"Measured value"},{"$f":"E4","v":"Maximum Score"},{"$f":"E3","v":"Score"},{"$f":"Tags!D57","v":"Maximum Contribuition for Final Score"},{"$f":"Tags!D58","v":"Contribuition for Final Score"},{"$f":"Tags!D59","v":"Remarks"}]
["B.1",{"$f":"Languages!B257","v":"Extra provisions in car park"},null,10,{"$f":"IF(ISERROR(E10+E11+E12+E13+E14+E15+E16+E17+E18+E19),\"NA\",SUM(E10:E19))","v":"NA"},{"$f":"D9/$F$4*$F$6","v":4.5454545454545459},{"$f":"IF(ISNUMBER(E9),E9/$F$4*$F$6,0)","v":0}]
[null,{"$f":"Languages!B258","v":"Special motorcycle area (Yes= 1, No= 0)"},null,null,{"$f":"IF(C10=yes,1,IF(C10=no,0,\"NA\"))","v":"NA"}]
[null,{"$f":"Languages!B259","v":"Lockers for customers’ use (Yes= 1, No= 0)"},null,null,"NA"]
[null,{"$f":"Languages!B260","v":"Other aids (Yes= 1, No= 0)"},null,null,"NA"]
[null,{"$f":"Languages!B261","v":"Bicycle rent (Yes= 1, No= 0)"},null,null,"NA"]
[null,{"$f":"Languages!B262","v":"Other Driver Assistance (Yes= 1, No= 0)"},null,null,"NA"]
[null,{"$f":"Languages!B263","v":"Vending Machines (Yes= 1, No= 0)"},null,null,"NA"]
[null,{"$f":"Languages!B264","v":"Heart Defibrillator (Yes= 1, No= 0)"},null,null,"NA"]
[null,{"$f":"Languages!B265","v":"First aid trained staff (Yes= 1, No= 0)"},null,null,"NA"]
[null,{"$f":"Languages!B266","v":"Real time traffic data (Yes= 1, No= 0)"},null,null,"NA"]
[null,{"$f":"Languages!B267","v":"Other real time accessible information (e.g. local events) (Yes= 1, No= 0)"},null,null,"NA"]
["B.2",{"$f":"Languages!B268","v":"Measures to avoid traffic queues at peak hours (i.e. tidal lane at car entry/exit) - (Yes= 3, No= 0)"},null,3,{"$f":"IF(C20=yes,3,IF(C20=yes,0,\"NA\"))","v":"NA"},{"$f":"D20/$F$4*$F$6","v":1.3636363636363638},{"$f":"IF(ISNUMBER(E20),E20/$F$4*$F$6,0)","v":0}]
["B.3",{"$f":"Languages!B269","v":"Turn around possibility for cars before height barrier or full sign to prevent reversing (Yes= 3, No= 0)"},null,3,{"$f":"IF(C21=yes,3,IF(C21=yes,0,\"NA\"))","v":"NA"},{"$f":"D21/$F$4*$F$6","v":1.3636363636363638},{"$f":"IF(ISNUMBER(E21),E21/$F$4*$F$6,0)","v":0}]
["B.4",{"$f":"Languages!B270","v":"Customer service desk (Yes= 1, No= 0)"},null,1,{"$f":"IF(C22=yes,1,IF(C22=yes,0,\"NA\"))","v":"NA"},0.45454545454545459,0]
["B.5",{"$f":"Languages!B271","v":"Escalators and/or travellators\r(To/from all levels =5, To/from some levels =3, No Escalators or Travellators = 0)"},null,5,{"$f":"IF(C23=Options!B190,5,IF(C23=Options!B191,3,IF(C23=Options!B192,0,\"NA\")))","v":"NA"},2.2727272727272729,0]
["B.6",{"$f":"Languages!B272","v":"Localisation of parked cars by ticket or license plate\r(Yes= 1, No= 0)"},null,1,{"$f":"IF(C24=yes,1,IF(C24=yes,0,\"NA\"))","v":"NA"},0.45454545454545459,0]
["B.7",{"$f":"Languages!B273","v":"Other positive points e.g. extra services, friendly staff, tiled walls/floors, good fit of the car park in cityscape etc up to ten additional bonus points. To be explicitly identified."},null,10,{"$f":"IF(ISNUMBER(C25),C25,\"NA\")","v":"NA"},4.5454545454545459,0]
[null,{"$f":"CONCATENATE(Tags!$B$50,\" \",$B$1)","v":"Subtotals Bonus Points"},null,{"$f":"SUM(D9:D25)","v":33},{"$f":"SUM(E20:E25,E9)","v":0},{"$f":"SUM(F9:F25)","v":15.000000000000004},{"$f":"SUM(G9:G25)","v":0}]
[]
[{"$f":"Tags!B60","v":"Notes"}]

{"sheet":"Gold Award","index":15,"n_rows":38,"n_cols":7,"rows_kept":38,"cut":false,"hidden":false,"merged":[[2,3,2,6],[28,3,33,6],[31,0,33,1],[31,2,33,2],[28,0,30,1],[20,0,20,1],[24,0,24,1],[26,0,26,1],[28,2,30,2],[4,3,4,6],[5,3,5,6],[7,0,7,1],[10,0,10,1],[3,3,3,6],[37,2,39,2],[34,0,36,1],[37,0,39,1],[34,3,39,6],[34,2,36,2]]}
[{"$f":"Tags!B71","v":"Global Evaluation - Gold Award"},null,null,null,null,{"$f":"Tags!B49","v":"% Completion:"},{"$f":"C9/3","v":0}]
[]
[{"$f":"Tags!B69","v":"Mandatory Conditions for Golden Award"},null,{"$f":"'1. Mandatory Conditions'!C3","v":"Compliant"},{"$f":"Tags!B23","v":"Comments"}]
["1.2",{"$f":"Languages!B7","v":"Minimum headroom = 2,00 m, generally in the public areas. Incidental lower obstacles must be clearly marked."}]
["1.4",{"$f":"Languages!B10","v":"70% of bays must be at least 2.40m wide."}]
["1.11",{"$f":"Languages!B18","v":"Average light levels on parking area at floor is at minimum 50 Lux"}]
[]
[{"$f":"Tags!B39","v":"Category"},null,"Number of Oks","Number of Fails",null,null,{"$f":"G11","v":"Status"}]
[1,{"$f":"'1. Mandatory Conditions'!B1","v":"Mandatory Minimum Conditions"},{"$f":"COUNTIF($C$4:$C$6,Options!B20)","v":0},{"$f":"COUNTIF($C$4:$C$6,Options!B21)","v":0},null,null,{"$f":"IF(Evaluation!M4=pass,IF(D9>0,fail,IF(C9=3,pass,incomplete)),Evaluation!M4)","v":"Fail"}]
[]
[{"$f":"A8","v":"Category"},null,{"$f":"Tags!B44","v":"% Obtained"},{"$f":"Tags!B45","v":"Minimum"},{"$f":"Tags!B46","v":"Category Points"},{"$f":"Tags!B47","v":"Points Obtained"},{"$f":"Tags!B48","v":"Status"}]
[{"$f":"'2. Lighting'!$A$1","v":2},{"$f":"'2. Lighting'!$B$1","v":"Lighting"},{"$f":"Evaluation!I7","v":0},0.5,16,{"$f":"C12*E12","v":0},{"$f":"IF(C12>D12,pass,fail)","v":"Fail"}]
[{"$f":"'3. Entry Exit'!$A$1","v":3},{"$f":"'3. Entry Exit'!$B$1","v":"Car Entry / Car Exit"},{"$f":"Evaluation!I8","v":0},0.5,8,{"$f":"C13*E13","v":0},"Fail"]
[{"$f":"'4. Parking Area'!$A$1","v":4},{"$f":"'4. Parking Area'!$B$1","v":"Parking Area"},{"$f":"Evaluation!I9","v":0},0.5,20,0,"Fail"]
[{"$f":"'5. Ramps'!$A$1","v":5},{"$f":"'5. Ramps'!$B$1","v":"Vehicle Ramps"},{"$f":"Evaluation!I10","v":0},0.5,8,0,"Fail"]
[{"$f":"'6. Pedestrian Access'!$A$1","v":6},{"$f":"'6. Pedestrian Access'!$B$1","v":"Pedestrian Access"},{"$f":"Evaluation!I11","v":0},0.5,16,0,"Fail"]
[7,{"$f":"'7. Security equipment'!$B$1","v":"Security Equipment"},{"$f":"Evaluation!I12","v":0},0.5,8,0,"Fail"]
[8,{"$f":"'8. Wayfinding'!$B$1","v":"Wayfinding Inside and Outside"},{"$f":"Evaluation!I13","v":0},0.5,8,0,"Fail"]
[9,{"$f":"'9. Comfort'!$B$1","v":"Comfort and Miscellaneous"},{"$f":"Evaluation!I14","v":0},0.4,8,0,"Fail"]
[10,{"$f":"'10. Energy Environment'!$B$1","v":"Energy and Environment"},{"$f":"Evaluation!I15","v":0},0.25,8,0,"Fail"]
[{"$f":"Tags!B50","v":"Subtotals"},null,null,null,{"$f":"SUM(E12:E20)","v":100},{"$f":"SUM(F12:F20)","v":0}]
[]
[{"$f":"Minus!$A$1","v":"M"},{"$f":"Minus!$B$1","v":"Minus Points"},{"$f":"Evaluation!I18","v":0},null,-15,{"$f":"E23*C23","v":0}]
[{"$f":"Bonus!$A$1","v":"B"},{"$f":"Bonus!$B$1","v":"Bonus Points"},{"$f":"Evaluation!I19","v":0},null,15,{"$f":"C24*E24","v":0}]
[{"$f":"A21","v":"Subtotals"},null,null,null,{"$f":"SUM(E23:E24)","v":0},{"$f":"SUM(F23:F24)","v":0}]
[]
[{"$f":"Tags!B51","v":"Totals"},null,null,null,{"$f":"E21+E25","v":100},{"$f":"F21+F25","v":0}]
[]
[{"$f":"UPPER(Tags!B52)","v":"MINIMUM REQUIREMENT FOR ESPA AWARD"},null,0.65,{"$f":"Tags!B70","v":"ESPA Gold Award"}]
[]
[]
[{"$f":"UPPER(Tags!B44)","v":"% OBTAINED"},null,{"$f":"F27/E27","v":0}]
[]
[]
[{"$f":"Evaluation!F24","v":"MANDATORY MINIMUM CONDITIONS"},null,{"$f":"IF(G9=pass,\"OK\",IF(G9=fail,\"KO\",\"-\"))","v":"KO"},{"$f":"UPPER(IF(AND(C32>=C29,C35=\"OK\",C38=\"OK\"),yes,IF(OR(C32<C29,C35=\"KO\",C38=\"KO\"),no,\"NA\")))","v":"NO"}]
[]
[]
[{"$f":"Evaluation!F27","v":"CATEGORIES MINIMUM POINTS"},null,{"$f":"IF(COUNTIF(G12:G20,fail)>0,\"KO\",\"OK\")","v":"KO"}]

{"sheet":"Languages","index":16,"n_rows":273,"n_cols":9,"rows_kept":273,"cut":false,"hidden":true,"merged":[]}
[{"$f":"'Languages Available'!B1","v":1},"Language Selected:",null,{"$f":"'General Info'!E3","v":"English"}]
[null,null,null,1,2,3,4,5,6]
[null,"Active Language",null,{"$f":"VLOOKUP(D2,'Languages Available'!$A$3:$B$23,2)","v":"English"},{"$f":"VLOOKUP(E2,'Languages Available'!$A$3:$B$23,2)","v":"Dutch"},{"$f":"VLOOKUP(F2,'Languages Available'!$A$3:$B$23,2)","v":"Français"},{"$f":"VLOOKUP(G2,'Languages Available'!$A$3:$B$23,2)","v":"Deutsch"},{"$f":"VLOOKUP(H2,'Languages Available'!$A$3:$B$23,2)","v":"Spanish"},{"$f":"VLOOKUP(I2,'Languages Available'!$A$3:$B$23,2)","v":"Portuguese"}]
[{"$f":"C4","v":1},{"$f":"IF(ISBLANK(VLOOKUP(A4,$C$4:$V$9989,1+$A$1)),D4,VLOOKUP(A4,$C$4:$V$9989,1+$A$1))","v":"Mandatory Minimum Conditions"},1,"Mandatory Minimum Conditions","Verplichte minimum eisen","Conditions minimales obligatoires","Mindestbedingungen","Condiciones mínimas obligatorias","Condições Mínimas Necessárias"]
[2,"Car park must be for public use",{"$f":"C4+1","v":2},"Car park must be for public use","Garage moet publiek toegankelijk zijn","Le parking doit être à usage public","Das Parkhaus muss öffentlich sein","El aparcamiento debe ser de uso público","Parque de estacionamento para uso público"]
[3,"Minimum headroom = 1.90 m, generally in the public areas. Incidental lower obstacles must be clearly marked.",{"$f":"C5+1","v":3},"Minimum headroom = 1.90 m, generally in the public areas. Incidental lower obstacles must be clearly marked.","Minimale inrijhoogte 1,90 m. Incidentele plaatsen met lagere hoogte moeten duidelijk gemarkeerd zijn.","Hauteur minimale au plafond=1.90m dans la majorité des espaces dédiés au public. Les quelques éventuels passages plus bas doivent être clairement signalés .","Mindestdurchfahrtshöhe = 1.90 m im allgemein zugänglichen Bereich. Einzelne niedrigere Hindernisse müssen deutlich gekennzeichnet sein.","Gálibo mínimo = 1.90 m, por regla general en las zonas públicas. Cualquier obstáculo eventual deberá estar claramente señalizado.","Pé-direito mínimo = 1,90 m, geralmente nas áreas públicas. Eventuais obstáculos a menor altura devem estar claramente identificados."]
[4,"Minimum headroom = 2,00 m, generally in the public areas. Incidental lower obstacles must be clearly marked.",4,"Minimum headroom = 2,00 m, generally in the public areas. Incidental lower obstacles must be clearly marked.","Minimale inrijhoogte 2,00 m. Incidentele plaatsen met lagere hoogte moeten duidelijk gemarkeerd zijn.","Hauteur minimale au plafond=2,00m dans la majorité des espaces dédiés au public. Les quelques éventuels passages plus bas doivent être clairement signalés .","Mindestdurchfahrtshöhe = 2,00 m im allgemein zugänglichen Bereich. Einzelne niedrigere Hindernisse müssen deutlich gekennzeichnet sein.","Gálibo mínimo = 2.00 m, por regla general en las zonas públicas. Cualquier obstáculo eventual deberá estar claramente señalizado.","Pé-direito mínimo = 2,00 m, geralmente nas áreas públicas. Eventuais obstáculos a menor altura devem estar claramente identificados."]
[5,"There must be at least one dedicated entry and exit lane although additional tidal flow lanes are allowed.",5,"There must be at least one dedicated entry and exit lane although additional tidal flow lanes are allowed.","Er moet ten minste één gescheiden inrit en uitrit zijn, extra wisselstroken zijn toegestaan.","Il doit y avoir minimum une  voie d’entrée et une voie de sortie, une troisième voie bidirectionnelle est autorisée.","Es müssen getrennte Ein- und Ausfahrtsspuren vorhanden sein. Tageszeitlich in wechselnder Fahrtrichtung genutzte Wechselspuren sind zulässig.","Deberá haber al menos un carril exclusivo de entrada y otro de salida, si bien se permitirán carriles reversibles adicionales","Deve existir pelo menos um acesso exclusivo para entradas e um acesso exclusivo para saídas, apesar de poderem existir vias de fluxo bidirecional adicionais."]
[6,"70% of bays must be at least 2.30m wide. For renovated car parks, over ten years old, minimum bay width of 2.25m is allowed (in that case a penalty applies - check M8).",6,"70% of bays must be at least 2.30m wide. For renovated car parks, over ten years old, minimum bay width of 2.25m is allowed (in that case a penalty applies - check M8).","70% van de parkeervakken moet minstens 2.30m breed zijn. Voor gerenoveerde garages, ouder dan tien jaar is een minimum breedte van 2.25m toegestaan. In dergelijke gevallen worden vijf punten in mindering gebracht, die elders gecompenseerd moeten worden","70% des emplacements doivent faire au moins 2.30m de large.\nPour des parkings rénovés de plus de 10 ans, une largeur minimum de 2.25m est tolérée. Cependant, dans ce cas, une pénalité de 5 points est appliquée, à compenser ailleurs.","70% der Stellplätze müssen mindestens 2,30 m breit sein. Für renovierte Parkhäuser, die älter als 10 Jahre sind, wird ausnahmsweise eine Stellplatzbreite von 2,25 m toleriert. In diesem Fall kommt ein Pauschalabzug zur Anwendung (siehe M8).","El 70% de las plazas debe tener un ancho mínimo de 2.30m. Para aparcamientos renovados, de más de 10 años de antigüedad, se permite un ancho mínimo de 2.25m (en ese caso se aplica una penalización - ver M8)","70% dos lugares de estacionamento devem ter no mínimo 2.30m de largura. Para parques de estacionamento renovados, com mais de dez anos de idade, a largura mínima do lugar permitida é de 2.25m (neste caso aplica-se uma penalidade - ver M8)."]
[7,"70% of bays must be at least 2.40m wide.",7,"70% of bays must be at least 2.40m wide.","70% van de parkeervakken moet minstens 2.40m breed zijn.","70% des emplacements doivent faire au moins 2.40m de large.","70% der Stellplätze müssen mindestens 2,40 m breit sein.","El 70% de las plazas debe tener un ancho mínimo de 2.40m","70% dos lugares de estacionamento devem ter no mínimo de 2.40m de largura."]
[8,"All straight ramps for  unidirectional traffic must be minimum 2.7 metres wide. Bidirectional ramps must be at least 6m wide with lane markings. Ramp width is measured between walls or pillars",8,"All straight ramps for  unidirectional traffic must be minimum 2.7 metres wide. Bidirectional ramps must be at least 6m wide with lane markings. Ramp width is measured between walls or pillars","Alle hellingbanen voor auto's voor één richting moeten minstens 2,7 meter breed zijn; bij tweerichtingsverkeer minstens 6 meter breed met midden markering. De breedte wordt gemeten tussen wanden of kolommen.","Toutes les rampes droites à trafic unidirectionnel doivent faire minimum 2.70m de large.\nEn cas de rampes bidirectionnelles, celles-ci doivent faire  minimum 6m de large avec marquage des voies.\nLa largeur des rampes est mesurée entre les murs ou piliers.","Gerade Rampen mit Einrichtungsverkehr müssen mindestens 2,70 m breit sein.\nGerade Gegenverkehrsrampen müssen mindestens 6 m breit sein und eine Fahrbahnmarkierung aufweisen.\nDie Breite der Rampen wird zwischen Wänden oder Stützen gemessen.\n","Las rampas rectas para tráfico unidireccional deben tener un ancho mínimo de 2.7m. Las rampas de doble sentido tendrán un ancho mínimo de 6m, con marcas viales de separación. El ancho de la rampa se mide entre paredes o pilares.","Todas as rampas retas com tráfego unidirecional devem ter no mínimo 2.7 metros de largura. Rampas bidirecionais devem ter no mínimo 6m de largura, com marcações das faixas. A largura da rampa é medida entre paredes ou pilares"]
[9,"Curved ramps for single directional traffic must have an external radius of minimum 8.00 metres with lane width of minimum 3.5 metres. For bidirectional curved ramps this applies for the inner driving lane. The outside driving lane must be minimum 3.5 metres wide as well. ",9,"Curved ramps for single directional traffic must have an external radius of minimum 8.00 metres with lane width of minimum 3.5 metres. For bidirectional curved ramps this applies for the inner driving lane. The outside driving lane must be minimum 3.5 metres wide as well. ","De buitenkant van een gebogen helling met eenrichtingsverkeer moet een straal van minstens 8 meter hebben met een rijstrook van minstens 3,5 meter breed. Bij hellingen met twee richtingsverkeer geldt dit voor de binnenste rijstrook.De buitenste rijstrook moet ook minstens 3,5 meter breed zijn.","Les rampes courbes pour un trafic unidirectionnel doivent présenter un radius externe de minimum 8m avec des voies de minimum 3.50m de large.\nPour des rampes courbes bidirectionnelles, les mesures sont d’application pour la voie intérieure de la courbe.La voie extérieure doit être de minimum 3.50m de large.","Gekrümmte Rampen mit Einrichtungsverkehr müssen einen Außenradius von mindestens 8,00 m aufweisen und die Fahrbahn muss mindestens 3,50 m breit sein. Bei gekrümmten Rampen mit Gegenverkehr gilt dasselbe für die innere Spur. Die äußere Spur muss ebenfalls mindestens 3,50 m breit sein.","Las rampas curvas para tráfico unidreccional deben tener un radio exterior de al menos 8.00m con un ancho mínimo de carril de 3.5m. Para rampas curvas de doble sentido, lo anterior aplica al carril interior. El carril exterior debe tener también un ancho mínimo de 3.5m.","Rampas curvas para tráfego direcional único devem ter um raio externo mínimo de 8.00 m, com largura de faixa mínima de 3.50 m. (Para rampas curvas bidirecionais, aplica-se para a faixa de rodagem interior. A faixa de rodagem exterior também deve ter largura mínima de 3.50 m)"]
[10,"Ramp gradients must not exceed 20% , to be measured at the middle of driving lane.  At bidirectional curved ramps this applies for the inner (steepest) driving lane.",10,"Ramp gradients must not exceed 20% , to be measured at the middle of driving lane.  At bidirectional curved ramps this applies for the inner (steepest) driving lane.","Hellingbanen mogen niet steiler zijn dan 20%, gemeten in het midden van de rijbaan. Bij gebogen hellingen voor twee richtingsverkeer geldt dit voor de binnenste rijstrook.","L’inclinaison de la rampe ne peut excéder 20%.Il doit être mesurée au centre de la voie de circulation. Pour les rampes courbes bidirectionnelles, ceci s’applique à la voie intérieure la plus abrupte.","Das Gefälle von Rampen darf 20 % nicht überschreiten. Es wird in der Fahrbahnachse gemessen. Bei mehrspurigen Rampen gilt dies jeweils für die innere (steilere) Spur.","Las pendientes de las rampas no pueden superar el 20%, medidas sobre el eje del carril. En las rampas curvas de doble sentido, lo anterior aplica al carril interior (el de mayor pendiente).","A inclinação das rampas não deve exceder 20%, medido no centro da faixa de rodagem. Em rampas curvas bidirecionais, aplica-se para a rampa interior (mais inclinada)."]
[11,"If the car park has paid parking and access control by barriers or gates, staff must be contactable at the pay point/exit point and secured pedestrian entries.",11,"If the car park has paid parking and access control by barriers or gates, staff must be contactable at the pay point/exit point and secured pedestrian entries.","Als de garage is uitgerust met slagbomen of afsluitpoorten voor betaald parkeren, moeten bij de betaalautomaten, uitritten en beveiligde toegangen voor voetgangers een intercom aanwezig zijn.","Si le parking est payant et dispose d’un contrôle d’accès par barrières ou portails, un personnel de service doit pouvoir être contacté aux bornes de paiement, aux bornes de sorties et aux entrées piétons sécurisées.","Bei bewirtschafteten Parkhäusern mit Zugangskontrolle durch Schranken oder Tore muss das Personal an allen Bezahlstationen, Ausfahrten sowie gesicherten Fußgängerzugängen z.B. kontaktierbar sein. ","Si el aparcamiento es de pago y dispone de control de acceso a través de barreras y puertas, deberá ser posible contactar con el personal en el punto de pago/punto de salida y en los accesos peatonales","Se o parque de estacionamento tem estacionamento pago e controlo de acessos por barreiras ou portões, funcionários devem estar contactáveis a partir dos locais de pagamento, das saídas e de entradas pedonais com porta fechada."]
[12,"Receipt for payment must be provided when requested.",12,"Receipt for payment must be provided when requested.","Op verzoek moet een kwitantie voor de betaling worden verstrekt.","Un reçu de paiement doit pouvoir être délivré en cas de demande.","Ein Zahlungsnachweis muss auf Verlangen herausgegeben werden.","Se proporcionará recibo en caso de ser solicitado por el usuario","Recibo de pagamento deve ser fornecido quando solicitado."]
[13,"All turning movements must be capable of being completed without reversing (moving in/out the parking bay and cul-de-sacs excluded)",13,"All turning movements must be capable of being completed without reversing (moving in/out the parking bay and cul-de-sacs excluded)","Alle voertuigbewegingen in de garage moeten zonder achteruitsteken uitgevoerd kunnen worden. (uitgezonderd in- en uitdraaien van een parkeervak en doodlopende rijstroken).","Tous les mouvements de véhicule doivent pouvoir être effectués sans devoir effectuer une marche arrière (exception faite pour se garer ou sortir d’un emplacement ainsi que les culs-de-sac).","Alle Kurvenfahrten müssen ohne Zurückstoßen möglich sein (Parkierungsvorgänge und Sackgassen sind hiervon ausgenommen).","Todos los giros se podrán realizar sin necesidad de dar marcha atrás (se excluyen las maniobras de estacionamiento y la circulación en calles sin salida)","Todos os movimentos de viragem devem poder ser concluídos necessidsde de inversão de marcha (manobras de estacionamento e becos sem saída estão excluídos)."]
[14,"Average light levels on parking area at floor is at minimum 20 Lux",14,"Average light levels on parking area at floor is at minimum 20 Lux","gemiddeld lichtniveau op vloerhoogte is minimaal 20 Lux",null,"Die durchschnittliche Beleuchtungsstärke am Boden beträgt mindestens 20 Lux.","Los niveles lumínicos medios en la plaza de estacionamiento a nivel del suelo serán de cómo mínimo 20 Lux","Níveis de luz médios na área de estacionamento, medidos ao nível do piso, são no mínimo de 20 Lux"]
[15,"Average light levels on parking area at floor is at minimum 50 Lux",15,"Average light levels on parking area at floor is at minimum 50 Lux","gemiddeld lichtniveau op vloerhoogte is minimaal 50 Lux",null,"Die durchschnittliche Beleuchtungsstärke am Boden beträgt mindestens 50 Lux.","Los niveles lumínicos medios en la plaza de estacionamiento a nivel del suelo serán de cómo mínimo 50 Lux","Níveis de luz médios na área de estacionamento, medidos ao nível do piso, são no mínimo de 50 Lux"]
[16,"Lighting",16,"Lighting","Verlichting","Eclairage","Beleuchtung","Iluminación","Iluminação"]
[17,"Item List (values in Lux, see user manual for measurement)",17,"Item List (values in Lux, see user manual for measurement)","Omschrijving (waardes in Lux)","Liste des mesures à effectuer ( valeurs en Lux,  se référer au manuel des mesures).","Positionsliste (Werte in Lux, bezüglich der Messungen siehe Benutzungsanleitung)","Lista de elementos (valores en Lux, ver manual de usuario para criterios de medida)","Lista de Itens (valores em Lux, consulte o manual do utilizador para a medição)"]
[18,"Vehicular entry area; at floor level\r•  Above 200 Lux = 5;\r•  Between 75– 200 Lux: 0,04 pt per Lux over 75  \r•  Below 75 Lux = 0",18,"Vehicular entry area; at floor level\n•  Above 200 Lux = 5;\n•  Between 75– 200 Lux: 0,04 pt per Lux over 75  \n•  Below 75 Lux = 0","Ingangspartij; op vloerhoogte:\n•  > 200 Lux = 5;\n•  75– 200 Lux = 0,04punt per Lux boven 75;\n•  < 75 Lux = 0","Aire d’entrée des véhicules, mesures effectuées au niveau du sol.\n•  Plus de 200 Lux = 5;\n•  Entre 75– 200 Lux: 0,04 pt par Lux au-delà de 75  \n•  Moins de 75 Lux = 0","Einfahrtsbereich, auf dem Boden\n•  über 200 Lux = 5;\n•  zwischen 75 - 200 Lux: 0,04 pt pro Lux über 75  \n•  weniger als 75 Lux = 0","Zona de acceso de vehículos; a nivel del suelo\n•  Más de 200 Lux = 5;\n•  Entre 75– 200 Lux: 0,04 pts por Lux por encima de 75  \n•  Menos de 75 Lux = 0","Zona de entrada de veículos, ao nível do chão\n•  Acima de 200 Lux = 5;\n•  Entre 75 e 200 Lux: 0,04 pt por cada Lux acima de 75;\n•  Abaixo de 75 Lux = 0;"]
[19,"Entry; at 1 m height near ticket-machine\r•  Above 200 Lux = 3;\r•  Between100– 200 Lux: 0,03 pt per Lux over 100\r•  Below 100 Lux = 0",19,"Entry; at 1 m height near ticket-machine\n•  Above 200 Lux = 3;\n•  Between100– 200 Lux: 0,03 pt per Lux over 100\n•  Below 100 Lux = 0","Inrit kaartgever; op 1 m hoogte\n•  > 200 Lux = 3;\n•  100-200  Lux = 0,03punt per Lux boven 100;\n•  • < 100 Lux = 0","Entrée ;  à 1m de hauteur près de la borne d’entrée (tickets)\n•  Plus de 200 Lux = 3;\n•  Entre 100– 200 Lux: 0,03 pt par Lux au-delà de 100\n•  Moins de 100 Lux = 0","Einfahrt ;  in 1 m Höhe beim Ticketgeber\n•  über 200 Lux = 3;\n•  zwischen 100 - 200 Lux: 0,03 pt pro Lux über 100\n•  weniger als 100 Lux = 0","Acceso; a 1 m de altura junto a la máquina expendedora de tickets\n•  Más de 200 Lux = 3;\n•  Entre 100– 200 Lux: 0,03 pts por Lux por encima de 100\n•  Menos de 100 Lux = 0","Zona de entrada de veículos, a 1 m de altura, perto da máquina de bilhetes\n•  Acima de 200 Lux = 3;\n•  Entre 100 e 200 Lux: 0,03 pt por cada Lux acima de 100;\n•  Abaixo de 100 Lux = 0"]
[20,"Exit; at 1 m height near barrier/ticket-machine\r•  Above 200 Lux = 3;\r•  Between100– 200 Lux: 0,03 pt per Lux over 100\r•  Below 100 Lux= 0",20,"Exit; at 1 m height near barrier/ticket-machine\n•  Above 200 Lux = 3;\n•  Between100– 200 Lux: 0,03 pt per Lux over 100\n•  Below 100 Lux= 0","Uitrit kaartlezer; op 1 m hoogte\n• > 200 Lux = 3; \n• 100-200 Lux =0,03punt per Lux boven 100;\n• < 100 Lux = 0 ","Sortie ;  à 1 m de hauteur près de la borne  de sortie (tickets)\n•  Plus de 200 Lux = 3;\n•  Entre 100– 200 Lux: 0,03 pt par Lux au-delà de 100\n•  Moins de 100 Lux= 0","Ausfahrt ;  in 1 m Höhe beim Ausfahrtskontrollgerät\n•  über 200 Lux = 3;\n•  zwischen 100 - 200 Lux: 0,03 pt pro Lux über 100\n•  weniger als 100 Lux= 0","Salida; a 1 m de altura junto a la barrera/máquina de tickets\n•  Más de 200 Lux = 3;\n•  Entre 100– 200 Lux: 0,03 pts por Lux por encima de 100\n•  Menos de 100 Lux = 0","Zona de saída de veículos, a 1 m de altura perto da máquina de leitura de bilhetes:\n•  Acima de 200 Lux = 3;\n•  Entre 100 e 200 Lux: 0,03 pt por cada Lux acima de 100;\n•  Abaixo de 100 Lux= 0;"]
[21,"At pay-machine; at 1 m height\r•  Above 200 Lux =4;\r•  Between100– 200 Lux: 0,04 pt per Lux over 100\r•  Below 100 Lux= 0;\r•  No Pay Machines : same as exit (enter zero if this is the case)",21,"At pay-machine; at 1 m height\n•  Above 200 Lux =4;\n•  Between100– 200 Lux: 0,04 pt per Lux over 100\n•  Below 100 Lux= 0;\n•  No Pay Machines : same as exit (enter zero if this is the case)","Bij betaalautomaat; op 1 m hoogte\n• > 200 Lux =4; \n• 100-200  Lux = 0,04punt per Lux boven 100;\n• < 100 Lux= 0;\n• Indien geen betaalautomaten: als bij uitrit (0 invullen)","Au niveau des bornes de paiement , à 1m de hauteur\n•  Plus de 200 Lux =4;\n•  Entre 100– 200 Lux: 0,04 pt par Lux au-delà de 100\n•  Moins de 100 Lux= 0;\n•  Si pas de bornes de paiement, identique qu’à la sortie","Kassenautomat, in 1 m Höhe (in diesem Fall bitte Null eingeben)\n•  über 200 Lux = 4;\n•  zwischen 100 - 200 Lux: 0,04 pt pro Lux über 100\n•  weniger als 100 Lux = 0;\n•  Kein Kassenautomat: wie bei Ausfahrt","En la máquina de pago; a 1 m de altura\n•  Más de 200 Lux = 4;\n•  Entre 100– 200 Lux: 0,04 pts por Lux por encima de 100\n•  Menos de 100 Lux = 0;\n•  Si no hay máquinas de pago: igual que en salida (poner \"cero\" si es el caso)","Junto às Máquinas de Pagamento, a 1 m de altura:\n•  Acima de 200 Lux = 4;\n•  Entre 100 e 200 Lux: 0,04 pt por cada Lux acima de 100;\n•  Abaixo de 100 Lux= 0;\n• Se não houver máquinas de pagamento, pontuação semelhamte à da saída. (introduza zero se for este o caso)"]
[22,"At cashier; at counter height\r•  Above 200 Lux =4;\r•  Between100– 200 Lux: 0,04 pt per Lux over 100\r•  Below 100 Lux= 0;\r•  No cashier = 3 (enter zero if this is the case)",22,"At cashier; at counter height\n•  Above 200 Lux =4;\n•  Between100– 200 Lux: 0,04 pt per Lux over 100\n•  Below 100 Lux= 0;\n•  No cashier = 3 (enter zero if this is the case)","Bij de kassier; op toonbankhoogte\n• > 200 Lux =4;\n• 100-200  Lux = 0,04punt per Lux boven 100;\n• < 100 Lux= 0;\n• Geen kassier  = 3","Auprès du caissier, à hauteur du comptoir\n•  Plus de 200 Lux =4;\n•  Entre 100– 200 Lux: 0,04 pt par Lux au-delà de 100\n•  Moins de 100 Lux= 0;\n•  Pas de caissier = 3","An der Kasse, auf Höhe des Tresens\n•  über 200 Lux = 4;\n•  zwischen 100 - 200 Lux: 0,04 pt pro Lux über 100\n•  weniger als 100 Lux = 0;\n•  Keine Kasse = 3  (in diesem Fall bitte Null eingeben)","Pago manual; a la altura del mostrador\n•  Más de 200 Lux = 4;\n•  Entre 100 – 200 Lux: 0,04 pts por Lux por encima de 100\n•  Menos de 100 Lux = 0;\n•  Si no hay pago manual = 3 (poner \"cero\" si es el caso)","Junto à Caixa Manual, à altura do balcão\n•  Acima de 200 Lux = 4;\n•  Entre 100 e 200 Lux: 0,04 pt por cada Lux acima de 100\n•  Abaixo de 100 Lux = 0;\n•  Se não houver caixa manual = 3 (introduza zero se for este o caso);"]
[23,"In elevator; at floor level\r•  Above 70 Lux = 4;\r•  Between30– 70 Lux: 0,1 pt per Lux over 30\r•  Below 30 Lux = 0;\r•  Single level without elevator = 3 (enter zero if this is the case)",23,"In elevator; at floor level\n•  Above 70 Lux = 4;\n•  Between30– 70 Lux: 0,1 pt per Lux over 30\n•  Below 30 Lux = 0;\n•  Single level without elevator = 3 (enter zero if this is the case)","In lift; op vloerhoogte\n• > 70 Lux = 4; \n• 30-70  Lux = 0,1punt per Lux boven 30;\n• < 30 Lux = 0; \n• Eénlaags garage zonder lift = 3 (0 invullen)","Dans les ascenseurs, au niveau du sol\n•  Plus de  70 Lux = 4;\n•  Entre 30– 70 Lux: 0,1 pt par Lux au-delà de 30\n•  Moins de 30 Lux = 0;\n•  Pas d’ascenseur, parking sur un niveau = 3","In Aufzügen, auf dem Boden\n•  über 70 Lux = 4;\n•  zwischen 30 - 70 Lux: 0,1 pt pro Lux über 30\n•  weiniger als 30 Lux = 0;\n•  eingeschossiges Parkhaus ohne Aufzug = 3  (in diesem Fall bitte Null eingeben)","En ascensor; a nivel del suelo\n•  Más de 70 Lux = 4;\n•  Entre 30 – 70 Lux: 0,1 pts por Lux por encima de 30\n•  Menos de de 30 Lux = 0;\n•  Planta única sin ascensor = 3 (poner \"cero\" si es el caso)","No elevador, ao nível do chão:\n•  Acima de 70 Lux = 4;\n•  Entre 30 e 70 Lux: 0,1 pt por cada Lux acima de 30;\n•  Abaixo de 30 Lux = 0;\n•  Parque sem elevador = 3 (introduza zero se for este o caso)"]
[24,"In staircases and all other exclusive pedestrian routes; at floor level\r•  Above 90 Lux = 3;\r•  Between30– 90 Lux: 0,05 pt per Lux over 30\r•  Below 30 Lux = 0;",24,"In staircases and all other exclusive pedestrian routes; at floor level\n•  Above 90 Lux = 3;\n•  Between30– 90 Lux: 0,05 pt per Lux over 30\n•  Below 30 Lux = 0;","Trappenhuizen en andere voetgangersruimten; op vloerhoogte\n• > 90 Lux = 3; \n• 30-90  Lux = 0,05punt per Lux boven 30;\n• < 30 Lux = 0;","Dans les cages d’escaliers et tout autre accès exclusivement réservé aux piétons, au niveau du sol\n•  Plus de 90 Lux = 3;\n•  Entre 30– 90 Lux: 0,05 pt par Lux au-delà de 30\n•  Moins de 30 Lux = 0;","In Treppenhäusern und anderen ausgewiesenen Fußgängerbereichen\n•  über 90 Lux = 3;\n•  zwischen 30 - 90 Lux: 0,05 pt pro Lux über 30\n•  weniger als 30 Lux = 0;","En escaleras y otros accesos peatonales; a nivel del suelo\n•  Más de 90 Lux = 3;\n•  Entre 30 – 90 Lux: 0,05 pts por Lux por encima de 30\n•  Menos de 30 Lux = 0;","Escadarias e todas os outros acessos pedonais exclusivos, ao nível do chão:\n•  Acima de 90 Lux = 3;\n•  Entre 30 e 90 Lux: 0,05 pt por cada Lux acima de 30;\n•  Abaixo de 30 Lux = 0;"]
[25,"Light levels on parking area at floor level: (plesase fill grid below) \rAverage light level of grid:\r•  Above 100 Lux= 10;\r•  Between20– 100 Lux: 0,125 pt per Lux over 20 \r•  Below 20 Lux= 0",25,"Light levels on parking area at floor level: (plesase fill grid below) \nAverage light level of grid:\n•  Above 100 Lux= 10;\n•  Between20– 100 Lux: 0,125 pt per Lux over 20 \n•  Below 20 Lux= 0","Lichtiniveau op vloerhoogte, gemiddelde van de metingen volgens stramien (zie onder)\n• > 100 Lux= 10; \n• 20-100  Lux = 0,125punt per Lux boven 20;\n• < 20 Lux= 0","Eclairages des aires de stationnement, à mesurer au niveau du sol: (remplissez la grille ci-dessous svp) \nMoyenne des mesures reprises dans la grille:\n•  Plus de 100 Lux= 10;\n•  Entre 20– 100 Lux: 0,125 pt par Lux au-delà de 20 \n•  Moins de 20 Lux= 0","Beleuchtung der Parkebenen auf dem Boden: (bitte Raster unten eintragen) \nmittlere Beleuchtungsstärke innerhalb des Rasters:\n•  über 100 Lux = 10;\n•  zwischen 20 - 100 Lux: 0,125 pt pro Lux über 20 \n•  weniger als 20 Lux= 0","Niveles lumínicos en la zona de estacionamiento a nivel de suelo: (rellenar tabla más abajo) \nNivel lumínico medio de la tabla:\n•  Más de 100 Lux = 10;\n•  Entre 20 – 100 Lux: 0,125 pts por Lux por encima de 20 \n•  Menos de 20 Lux = 0","Níveis de luminosidade na área de estacionamento ao nível do piso: (por favor preencha grelha abaixo)\nNível de luz média da grelha:\n•  Acima 100 Lux = 10;\n•  Entre 20 e 100 Lux: 0,125 pt por cada Lux acima de 20;\n•  Abaixo de 20 Lux = 0;"]
[26,"Uniformity of light levels in grid as standard deviation\r•  Under 25% of avg light level = 10;\r•  Between25– 50%: 0,4 pt per % under 50%\r•  Above 50% =  0",26,"Uniformity of light levels in grid as standard deviation\n•  Under 25% of avg light level = 10;\n•  Between25– 50%: 0,4 pt per % under 50%\n•  Above 50% =  0","Gelijkmatigheid van verlichtingsniveau in  stramien als berekende standaard deviatie: \n• < 25% van het gemiddelde = 10; \n• 25%-50% = 0,4 punt per % onder 50%;\n• > 50% = 0;","Uniformité de l’éclairage selon les mesures rapportées sur la grille (calcul par écart-type) \n•  Moins de 25% de la moyenne d’éclairage = 10;\n•  Entre  25– 50%: 0,4 pt par % en dessous de 50%\n•  Plus de 50% =  0","Gleichmäßigkeit der Beleuchtung (Standardabweichung)\n•  weniger als 25% der mittleren Beleuchtungsstärke = 10;\n•  zwischen  25 - 50%: 0,4 pt pro % unter 50%\n•  über 50% =  0","Uniformidad de los niveles lumínicos de la tabla, desviación estándar\n•  Menos de 25% del nivel lumínico medio = 10;\n•  Entre 25– 50%: 0,4 pts por % por debajo de 50%\n•  Más de 50% =  0","Uniformidade da luminosidade na grelha, (desvio padrão)\n• Inferior a 25% dos níveis médios de luminosidade = 10;\n•  Entre 25% e 50% dos níveis médios de luminosidsde: 0,4 pt por cada ponto percentual abaixo de 50%;\n•  Abaixo de 50% =  0"]
[27,"Auxiliary Grid for 2.8",27,"Auxiliary Grid for 2.8","Aanvullend stramien voor 2.8","Grille annexe au point 2.8","Hilfsraster 2.8","Tabla auxiliar para 2.8","Grelha Auxiliar para 2.8"]
[28,"end of parking space under/between light fitting",28,"end of parking space under/between light fitting","Einde parkeervak, onder/tussen verlichtlingsarmatuur","Fond aire de stationnement sous/entre points lumineux","Ende des Parkplatzes unter/zwischen Beleuchtungspunkten","Fondo de plaza bajo/entre luminarias","fim do espaço de estacionamento em/entre pontos de iluminação"]
[29,"halfway parking space under/between light fitting",29,"halfway parking space under/between light fitting","Halverwege parkeervak, onder/tussen verlichtlingsarmatuur","Milieu aire de stationnement sous/entre points lumineux","Mitte des Parkplatzes unter/zwischen Beleuchtungspunkten","Centro de plaza bajo/entre luminarias","espaço de estacionamento no meio do caminho em/entre pontos de iluminação"]
[30,"edge of driveway under/between light fitting",30,"edge of driveway under/between light fitting","Begin parkeervak/rand rijbaan, onder/tussen verlichtlingsarmatuur","Début aire de stationnement sous/entre points lumineux","Fahrbahnrand unter/zwischen Beleuchtungspunkten","Límite entre inicio de plaza y vial de circulación bajo/entre luminarias","linha entre lugar de estacionamento e via de circulação, sob/entre pontos de iluminação"]
[31,"center of driveway under/between light fitting",31,"center of driveway under/between light fitting","Midden rijbaan, onder/tussen verlichtlingsarmatuur","Centre de la voie de circulation sous/entre points lumineux.","Fahrbahnmitte unter/zwischen Beleuchtungspunkten","Centro de vial de circulación bajo/entre luminarias","centro de via de circulação sob/entre pontos de iluminação"]
[32,"other edge of driveway under/between light fitting",32,"other edge of driveway under/between light fitting","Rand rijbaan/begin parkeervak overzijde, onder/tussen verlichtlingsarmatuur","Voie de circulation côté opposé à l’aire de stationnement sous/entre points lumineux","Anderer Fahrbahnrand unter/zwischen Beleuchtungspunkten","Vial de circulación en el lado opuesto a la zona estacionamiento bajo/entre luminarias","outra extremidade da calçada sob/entre pontos de iluminação"]
[33,"Car Entry / Car Exit",33,"Car Entry / Car Exit","In- en uitrit","Entrée / Sortie des voitures","Einfahrt / Ausfahrt","Acceso y salida de vehículos","Entradas e Saídas de Veículos"]
[34,"Car park headroom limit identified at entrance",34,"Car park headroom limit identified at entrance","Inrijhoogte aangegeven bij de inrit","Limite d’hauteur de plafond annoncée à l’entrée du parking","An der Einfahrt angezeigte Durchfahrtshöhe","Gálibo máximo indicado a la entrada","Limite de altura do parque de estacionamento identificado na entrada"]
[35,"Correct sign at entrance",35,"Correct sign at entrance","Bord overeenkomstig RVV","Signalisation correcte à l’entrée","Ordnungsgemäßes Zeichen an der Einfahrt","Señal correcta a la entrada","Sinal correto na entrada"]
[36,"Height barrier",36,"Height barrier","Hoogtebalk","Barre d’hauteur","Höhenbegrenzungsbalken","Delimitador de altura","Barreira de altura"]
[37,"Rubber lip to prevent damage",37,"Rubber lip to prevent damage","Rubber strip onderzijde hoogtebalk","Rebord caoutchouc sur barre pour prévenir dommages aux toits","Gummilippe am Höhenbegrenzungsbalken","Borde de goma para prevenir daños","Lip de borracha para evitar danos"]
[38,"Height:\r(The car park should receive one point for each 10cm of height above 1.90m up to 2.20 m)",38,"Height:\n(The car park should receive one point for each 10cm of height above 1.90m up to 2.20 m)","Inrijhoogte: de garage krijgt één punt voor elke 10cm inrijhoogte boven 1.9m tot 2.2 m","Hauteur\n(Le parking reçoit 1 point par tranche de 10cm au-delà de 1.90m jusqu’à 2.20m)","Durchfahrtshöhe:\n(Das Parkhaus erhält 1 Punkt pro 10 cm Durchfahrtshöhe über 1,90 m und 2,20 m)","Altura:\n(Se asigna al aparcamiento 1 punto por cada 10cm de altura por encima de 1.90m hasta 2.20m)","Altura:\n(Parque de estacionamento deve receber um ponto por cada 10 cm de altura acima de 1.90m, até um máximo de 2.20m)"]
[39,"Traffic signs to define limitations in use of facility.\r• Clear signing = 3\r• Incomplete signing = 2\r• No signing = 0)",39,"Traffic signs to define limitations in use of facility.\n• Clear signing = 3\n• Incomplete signing = 2\n• No signing = 0)","Verkeersborden voor beperkingen in de garage. \n• Duidelijk en compleet conform RVV = 3 \n• Gedeeltelijk complete bebording = 2 \n• Geen bebording = 0","Panneaux de signalisation stipulant les limites concernant le parking.\n(Signalisation claire = 3, Signalisation incomplète = 2, Pas de signalisation = 0)","Verkehrszeichen für Nutzungsbegrenzungen\n(vollständige und eindeutige Beschilderung = 3, Beschilderung unvollständig = 2, keine Beschilderung = 0)","Señales de tráfico para definir limitaciones en el uso de la instalación.\n• Señalización clara = 3\n• Señalización incompleta = 2\n• Sin señalización = 0","Sinais de trânsito para definir o uso limitado das instalações.\n• Sinalização evidente = 3\n• Sinalização incompleta = 2\n• Sem sinalização = 0"]
[40,"Information on:",40,"Information on:","Informatie bij de inrit:","Information concernant:","Information bezüglich:","Información sobre:","Informações sobre:"]
[41,"Operators terms & conditions within the car park:",41,"Operators terms & conditions within the car park:","Informatie algemene voorwaarden","Règlement intérieur du parking","Einstellbedingungen des Betreibers innerhalb des Parkhauses","Términos y condiciones en el interior del aparcamiento","Regras de utilização do parque de estacionamento:"]
[42,"Daily opening hours:",42,"Daily opening hours:","Dagelijkse opening- en sluitingstijd ","Heures d’ouverture","Öffnungszeiten","Horario de apertura:","Horário de funcionamento:"]
[43,"Scale of tariffs:",43,"Scale of tariffs:","Tarieftabel","Grille tarifaire","Parktarife","Tarifas:","Tarifário:"]
[44,"Readibility of tariff system:",44,"Readibility of tariff system:","Duidelijkheid van het tariefsysteem","Lisibilité de la grille tarifaire","Verständlichkeit der Parktarife","Facilidad de lectura del sistema de tarifas","Legibilidade do sistema tarifário:"]
[45,"Design entry/exit area",45,"Design entry/exit area","Ontwerp van de in- en uitrit","Conception des zones d’entrée et de sortie","Bauliche Ausbildung der Ein-/Ausfahrt","Diseño de la zona de acceso/salida","Área da Entrada/saída"]
[46,"Entry ticket- machine easy to reach:",46,"Entry ticket- machine easy to reach:","Inrijzuil gemakkelijk bereikbaar","Entrée: borne de tickets facilement atteignable","Einfahrt: Ticketgeber gut zu erreichen","Facilidad de acceso a la máquina de tickets de entrada","Bilhete na máquina de entrada fácil de alcançar"]
[47,"Exit ticket- machine easy to reach:",47,"Exit ticket- machine easy to reach:","Uitrijzuil gemakkelijk bereikbaar","Sortie: borne de tickets facilement atteignable","Ausfahrt: Ausfahrtskontrollgerät gut zu erreichen","Facilidad de acceso a la máquina de tickets de salida","Validador de bilhete na máquina de saída fácil de alcançar"]
[48,"Longitudinal slope at the ticket machines",48,"Longitudinal slope at the ticket machines","Is er een helling naar de kaartgever/lezer?","Pente longitudinale de la voie près des bornes de tickets","Längsgefälle im Bereich der Ticketgeber und Ausfahrtskontrollgeräte","Pendiente longitudinal en zona de máquinas de tickets","Inclinação longitudinal nas máquinas de bilhetes"]
[49,"Entry lane:\r• 0-2% (car doesn’t move without brake) = 1\r• 2-5% = 0\r• Above 5% = -1",49,"Entry lane:\n• 0-2% (car doesn’t move without brake) = 1\n• 2-5% = 0\n• Above 5% = -1","Inrit:\n• < 2% (auto beweegt niet uit zichzelf) = 1\n• 2-5% = 0\n• > 5% = -1","Entrée:\n(0-2% (le véhicule ne bouge pas sans poser le pied sur le frein) = 1, 2-5% = 0, Plus de 5% = -1)","Einfart:\n(0-2% (das Fahrzeug bleibt auch ohne Bremse stehen) = 1, 2-5% = 0, über 5% = -1)","Carril de entrada:\n• 0-2% (vehículo no se muede sin presionar el freno) = 1\n• 2-5% = 0\n• Más de 5% = -1","Via de entrada:\n• 0-2% (carro não se move sem travão) = 1\n• 2-5% = 0\n• Acima de 5% = -1"]
[50,"Exit lane:\r• 0-2% (car doesn’t move without brake) = 1\r• 2-5% = 0\r• Above 5% = -1",50,"Exit lane:\n• 0-2% (car doesn’t move without brake) = 1\n• 2-5% = 0\n• Above 5% = -1","Uitrit:\n• < 2% (auto beweegt niet uit zichzelf) = 1\n• 2-5% = 0\n• > 5% = -1","Sortie:\n(0-2% (le véhicule ne bouge pas sans poser le pied sur le frein) = 1, 2-5% = 0, Plus de 5% = -1)","Ausfahrt:\n(0-2% (das Fahrzeug bleibt auch ohne Bremse stehen) = 1, 2-5% = 0, über 5% = -1)","Carril de salida:\n• 0-2% (vehículo no se muede sin presionar el freno) = 1\n• 2-5% = 0\n• Más de 5% = -1","Via de saída:\n• 0-2% (carro não se move sem travão) = 1\n• 2-5% = 0\n• Acima de 5% = -1"]
[51,"Kerb design to avoid damage to average vehicle’s wheels:\r(Yes = 2, No protection = 0, No kerbs in entry/exit area = 2)",51,"Kerb design to avoid damage to average vehicle’s wheels:\n(Yes = 2, No protection = 0, No kerbs in entry/exit area = 2)","Stoeprand van eilanden met schuine kant ter bescherming van banden en velgen ","Forme spécifique des bordures pour éviter tout dommage  aux jantes  :\n(Oui = 2, Pas de protection = 0, Pas de bordures dans la zone d’entrée /de sortie = 2)","Schrammbordausbildung zum Schutz vor Beschädigung der Reifen und Felgen:\n(ja = 2, kein Schutz = 0, keine Schrammborde im Ein-Ausfahrtsbereich = 2)\n","Diseño de bordillos para evitar daños en las ruedas de un vehículo estándar:\n(Sí = 2, Sin protección = 0, Sin bordillos en zonas de entrada/salida = 2)","Proteção para evitar danos na rodas os veículos:\n(Sim = 2, Sem proteção = 0, Sem proteção na área de entrada/saída = 2)"]
[52,"Anti slip surfaces access/egress ramps:\r(Anti slip = 1, Slippery when wet = 0)",52,"Anti slip surfaces access/egress ramps:\n(Anti slip = 1, Slippery when wet = 0)","Ruw oppervlak op in- en uitrit helling\nRuw = 1, Glad = 0, geen helling = 1","Surface anti-dérapante dans les rampes d’entrée/de sortie:\n(Anti-dérapant = 1, Glissant si mouillé = 0)","Rutschfeste Oberfläche im Ein-/Ausfahrtsbereich:\n(rutschfest = 1, rutschig wenn nass = 0)","Superficies antideslizantes en zonas de entrada y salida de rampas:\n(Antideslizante = 1, Deslizante con piso húmedo = 0)","Superfíce antiderrapante nas rampas de acesso/saída:\n(Anti derrapante = 1, Escorregadio quando molhado = 0)"]
[{"$f":"C56","v":53},"Access security",53,"Access security","Toegangsbeveiliging","Sécurité des accès","Zugangskontrolle","Seguridad en accesos","Segurança dos Acessos"]
[54,"Barrier",54,"Barrier","Slagboom","Barrières","Schranke","Barreras","Barreira"]
[55,"Intercom",55,"Intercom","Parkeerhoek 76º-90º","Interphonie","Sprechstelle","Interfonía","Intercomunicador"]
[56,"CCTV",56,"CCTV","Parkeerhoek  45º-75º","Vidéosurveillance","Videoüberwachung","CCTV","CCTV"]
[57,"Licence Plate Recognition",57,"Licence Plate Recognition","Kentekenherkenning","Reconnaissance plaques d’immatriculation","Kennzeichenerkennung","Lector de matrículas","Leitor de Matrícula"]
[58,"Full height fast closing gates",58,"Full height fast closing gates","Snel sluitende hekken","Grilles de fermeture sur la hauteur totale","Schnelllauftore über die ganze Höhe","Portones de cierre rápido","Portões de Abertura Rápida"]
[59,"Staffed access(Entry or exit)",59,"Staffed access(Entry or exit)","Personeel (evt in de loge) bij de inrit/uitrit","Personnel présent (en entrée ou en sortie)","Bemannte Einfahrt/Ausfahrt","Acceso para personal (entrada o salida)","Presença de Staff (Entrada ou saída)"]
[60,"Entry/Exit of the building: width between structure (per lane)\r(< 3 m =0, 3 – 3.3 m =1, > 3.3 m = 2)",60,"Entry/Exit of the building: width between structure (per lane)\n(< 3 m =0, 3 – 3.3 m =1, > 3.3 m = 2)","Breedte in/uitrit tussen de constructie op spiegelhoogte, kolom, kozijn, poortconstructie o.i.d. (per strook)\n• < 3 m =0,  3 – 3.3 m =1,  > 3.3 m = 2","Largeur des entrées/sorties du bâtiment entre les structures (par voie)\n(< 3 m =0, 3 – 3.3 m =1, > 3.3 m = 2)","Durchfahrtsbreite zwischen Bauteilen im Bereich der Einfahrt/Ausfahrt\n(< 3 m =0, 3 – 3.3 m =1, > 3.3 m = 2)","Entrada/salida del edificio: ancho entre elemetnos estructurales (por carril)\n(< 3 m = 0, 3 – 3.3 m =1, > 3.3 m = 2)","Entrada/saída do edifício: largura entre elementos da estrutura (por faixa)\n(< 3 m =0, 3 – 3.3 m =1, > 3.3 m = 2)"]
[61,"Exit: exit slope ends at least 5 meters before crossing traffic (pedestrians/cyclists):",61,"Exit: exit slope ends at least 5 meters before crossing traffic (pedestrians/cyclists):","Uitrithelling eindigt minstens vijf meter voor kruisend verkeer (fietsers, voetgangers):","Sortie: la pente de  sortie s’arrête au plus tard 5m avant le croisement avec le trafic (piétons/cyclistes).","Ausfahrt: die Gefällestrecke endet mindestens 5 m vor dem kreuzenden Verkehr (Fußgänger/Radfahrer).","Salida: la pendiente de la rampa de salida finaliza al menos 5 metros de la incorporación al tráfico (peatones/ciclistas):","Saída: zona inclinação da rampa de saída termina pelo menos 5 metros antes de zona com tráfego (pedonal/ciclistas):"]
[62,"subtotal  car entry/exit",62,"subtotal  car entry/exit","Subtotaal in- en uitrit","Sous-total – Entrée / Sortie des voitures","Zwischensumme Einfahrt/Ausfahrt","subtotal acceso y salida de vehículos","subtotal Entrada Carros/ Saída de Carros"]
[63,"Parking Area",63,"Parking Area","Parkeervloer","Aires de stationnement","Parkebenen","Zonas de estacionamiento","Área do Estacionamento"]
[64,"Pillar placement for at least 85% of bays:\r• does not intrude into the parking area = 8 \r• at beginning of stall = 0\r• next to car door = 0\r• at back of stall but intrudes into the parking area = 4",64,"Pillar placement for at least 85% of bays:\n• does not intrude into the parking area = 8 \n• at beginning of stall = 0\n• next to car door = 0\n• at back of stall but intrudes into the parking area = 4","Kolomopstelling min 85% van de parkeervakken:\n• Kolommen compleet buiten de parkeervakken  = 8\n• Kolom aan het begin van het vak= 0\n• Kolom naast het autoportier = 0\n• Kolom achter in het vak maar binnen het vak = 4","Présence de piliers pour au moins 85% des emplacements:\n(ne déborde pas sur l’aire de stationnement = 8, au début de l’aire de stationnement= 0, près de la portière de voiture = 0, au fond de l’emplacement mais déborde sur celui-ci = 4)","Stützen im Bereich von mindestens 85 % der Stellplätze:\n(keine Beeinträchtigung des Stellplätze = 8, am Beginn der Stellplätze = 0, nahe der Fahrzeugtür = 0, am Ende aber mit Beeinträchtigung des Stellplatzes = 4)","Posición de pilares para al menos el 85% de las plazas:\n• No invade la zona de estacionamiento = 8 \n• al principio de la plaza = 0\n• junto a la puerta del vehículo = 0\n• en el fondo de plaza pero invade la zona de estacionamiento = 4","Localização dos Pilares em, pelo menos, 85% dos lugares:\n• não invadem a área de estacionamento = 8 \n• no início do lugar = 0\n• ao lado da porta do veículo = 0\n• recuados, mas na área de estacionamento = 4"]
[65,{"$f":"IF(ISBLANK(VLOOKUP(A68,$C$4:$V$9989,1+$A$1)),D68,VLOOKUP(A68,$C$4:$V$9989,1+$A$1))","v":"Visibility (many/few dead corners, walls in the car park etc.)\rGood=4, Medium=2 or Bad=0"},65,"Visibility (many/few dead corners, walls in the car park etc.)\nGood=4, Medium=2 or Bad=0","Overzichtelijkheid (dode hoeken, wanden in de garage etc )\n• Geen = 4, Hier en daar = 2, Veel = 0","Visibilité (beaucoup/peu d’angles morts, de murs dans le parking,etc.)\nBien=4, Moyen=2 ou Mauvais=0","Übersichtlichkeit (viele/wenige tote Winkel, Wände in der Parkebene,etc.)\ngut=4, mittel=2, schlecht=0","Visibilidad (muchos/pocos ángulos muertos, paredes en el aparcamiento, etc.)\nBuena = 4, Media = 2 o Mala = 0","Visibilidade (muitos/poucos cantos mortos, paredes no parque de estacionamento, etc.)\nBom=4, Médio=2 ou Mau=0"]
[66,"Signage for car driver:",66,"Signage for car driver:","Bebording voor autoverkeer:","Signalisation pour le conducteur","Beschilderung für den Fahrverkehr","Señalización para el conductor:","Sinalização rodoviária:"]
[67,"Do traffic signs conform to national road code?",67,"Do traffic signs conform to national road code?","Officiele verkeersborden overeenkomstig RVV?","Les panneaux de signalisation sont-ils conformes au code de la route du pays?","Sind die Verkehrszeichen konform mit den nationalen Vorschriften?","Las señales concuerdan con el código de carreteras del país?","Os sinais de rânsito estão conforme o código da estrada?"]
[68,"Routing and turn signs: Is signage clear, complete and unambiguous? ",68,"Routing and turn signs: Is signage clear, complete and unambiguous? ","Is bebording voor routing en bochten: ","Signalisation directionnelle: est-elle claire, complète, non équivoque.","Wegweisung: Ist die Beschilderung leicht sichtbar, vollständig und unmissverständlich?","La señalización direccional: es clara, completa e inequívoca?","Sinalização de circulação: A sinalização é clara, completa e inequívoca? "]
[69,"Complete ?",69,"Complete ?","Compleet?","Complète?","Vollständig?","Completa?","Completa ?"]
[70,"Easy to see ?",{"$f":"C72+1","v":70},"Easy to see ?","Goed zichtbaar?","Facile à voir?","Leicht zu sehen?","Fácil de ver?","Fácil de ver ?"]
[71,"Unambiguous ?",71,"Unambiguous ?","Eenduidig? ","Sans equivoque?","Unmissverständlich?","Inequívoca?","Inequívoca ?"]
[72,"Exit signs in the car park: Is signage clear, complete and unambiguous? ",72,"Exit signs in the car park: Is signage clear, complete and unambiguous? ","Bebording naar de uitrit: ","Les panneaux indiquant la sortie du parking: la signalisation est-elle claire, complète, sans équivoque?","Ausfahrtsbeschilderung: Ist die Beschilderung leicht sichtbar, vollständig und unmissverständlich?","La señalización indicando la salida del aparcamiento: es clara, completa e inequívoca?","Sinalização de saída do parque de estacionamento: A sinalização é clara, completa e inequívoca? "]
[73,"Complete ?",73,"Complete ?","Compleet?","Complète?","Vollständig?","Completa?","Completa ?"]
[74,"Easy to see ?",74,"Easy to see ?","Goed zichtbaar?","Facile à voir?","Leicht zu sehen?","Fácil de ver?","Fácil de ver ?"]
[75,"Unambiguous ?",75,"Unambiguous ?","Eenduidig? ","Sans équivoque?","Unmissverständlich?","Inequívoca?","Inequívoca ?"]
[76,"Parking bay marks",76,"Parking bay marks","Markering van de parkeervakken","Marquage des emplacements","Stellplatzmarkierung","Marcaje vial de plazas?","Marcação dos lugares de estacionamento"]
[77,"Parking bays are clearly marked ?",77,"Parking bays are clearly marked ?","Parkeervakken duidelijk herkenbaar?","Les emplacements sont-ils clairement marqués?","Sind die Stellplätze deutlich markiert?","Las plazas están claramente marcadas?","Lugares de estacionamento estão claramente marcados?"]
[78,"Bay markings extend up walls to assist driver ?",78,"Bay markings extend up walls to assist driver ?","Markering van parkeervakken doorgetrokken op de wand om orientatie te verbeteren?","Le marquage des emplacements est-il prolongé sur les murs pour assister le conducteur?","Sind die Markierungen bis auf die Wand verlängert um das Einparken zu erleichtern?","El marcaje se extiende sobre los paramentos verticales para facilitar la maniobra al conductor?","As marcações estendem-se até às paredes para ajudar os condutrores?"]
[79,"Are Road Markings:",79,"Are Road Markings:","Rijstrookmarkeringen","Le marquage routier au sol est-il :","Sind die Fahrbahnmarkierungen:","La señalización horizontal del aparcamiento es:","As marcações no pavimento são:"]
[80,"Complete ?",80,"Complete ?","Compleet?","Complet?","Vollständig?","Completa?","Completas ?"]
[81,"Easy to see ?",81,"Easy to see ?","Goed zichtbaar?","Facile à voir?","Leicht zu sehen?","Fácil de ver?","Fáceis de ver ?"]
[82,"Unambiguous ?",82,"Unambiguous ?","Eenduidig? ","Sans équivoque?","Unmissverständlich?","Inequívoca?","Inequívocas ?"]
[83,"Availability of spaces for disabled with wheelchair access anounced at the entrance the car park:",83,"Availability of spaces for disabled with wheelchair access anounced at the entrance the car park:","Invalidenplaatsen in de garage aangekondigd bij de inrit?","La présence et l’emplacement des places pour handicapés en chaise roulante sont-ils annoncés à l’entrée du parking?","Wird die Verfügbarkeit von Stellplätzen für Rollstuhlfahrer an der Einfahrt angezeigt?","Disponibilidad de plazas reservadas para personas de movilidad reducida anunciada a la entrada del aparcamiento:","Disponibilidade de lugares para pessoas com mobilidade condicionada anunciada na entrada do parque de estacionamento:"]
[84,"Accessible for wheelchair ?",84,"Accessible for wheelchair ?","Bereikbaar voor rolstoel?","Accessibilité pour chaises roulantes?","Zugänglich für Rollstühle?","Accesibilidad para silla de ruedas?","Acessibilidade para pessoas com mobilidade condicionada?"]
[85,"Bays minimum 3.5 m wide ?",85,"Bays minimum 3.5 m wide ?","Vakken minimal 3,5 m breed?","Largeur minimum des emplacements de 3.50m ?","Sind die Plätze mindestens 3.50 m breit?","Anchura mínima de plazas de 3.5m?","Lugares com mínimo de 3.5 m de largura ?"]
[86,"Close to pedestrian exit ?",86,"Close to pedestrian exit ?","Dichtbij de voetgangersuitgang?","Près des sorties piétons?","Sind sie Nahe am Ausgang?","Cerca de las salidas peatonales?","Perto da saída pedonal ?"]
[87,"Guidance to disabled spaces ?",87,"Guidance to disabled spaces ?","Geleiding naar de invalidenplaatsen?","Guidage vers les emplacements handicapés?","Gibt es eine Hinweisbeschilderung zu den Stellplätzen für Behinderte?","Guiado hacia las plazas reservadas?","Sinalização para pessoas com mobilidade condicionada?"]
[88,"Parking angle at 85 % of bays:\r(Angle 76-90° = 0, Angle  45-75° = 2)",88,"Parking angle at 85 % of bays:\n(Angle 76-90° = 0, Angle  45-75° = 2)","Parkeerhoek bij 85 % van de vakken:\n 76-90° = 0,   45-75° = 2","Angle pour 85% des emplacements de parkings\n(Angle 76-90° = 0, Angle  45-75° = 2)","Aufstellwinkel für 85% der Stellplätze (Winkel 76-90° = 0, Winkel  45-75° = 2)","Ángulo de aparcamiento para al menos el 85% de las plazas:\n(Ángulo 76-90° = 0, Ángulo  45-75° = 2)","Ângulo de estacionamento em 85% dos lugares:\n(Ângulo 76-90° = 0, Ângulo  45-75° = 2)"]
[89,"Width of bays (85 % of bays), A or B: \rA: Parking angle 76 – 90 degrees\r(2.25m = -5, 2.30m = 0, 2.35m = 2, 2.40m = 4, 2.45m = 6, 2.50m = 8) \rB: Parking angle 45-75 degrees\r(2.25m = -5, 2.30m = 1, 2.35m = 3, 2.40m = 5, 2.45m = 8)\rWidth of 2.25m only applies for renovated car parks, new car parks must be minimum 2.30m",89,"Width of bays (85 % of bays), A or B: \nA: Parking angle 76 – 90 degrees\n(2.25m = -5, 2.30m = 0, 2.35m = 2, 2.40m = 4, 2.45m = 6, 2.50m = 8) \nB: Parking angle 45-75 degrees\n(2.25m = -5, 2.30m = 1, 2.35m = 3, 2.40m = 5, 2.45m = 8)\nWidth of 2.25m only applies for renovated car parks, new car parks must be minimum 2.30m","Vakbreedte (85 % van de vakken) \nA: Parkeerhoek 76 – 90 graden\n• breedte 2.25m = -5, 2.30m = 0, 2.35m = 2, 2.40m = 4, 2.45m = 6, 2.50m = 8.\nB: Parkeerhoek  45-75 graden\n• breedte 2.25m = -5, 2.30m = 1, 2.35m = 3, 2.40m = 5, 2.45m = 8\nBreedte 2.25m alleen toelaatbaar bij gerenoveerde garages, bij nieuwe garages geldt de minimum vakbreedte 2.30m","Largeur des emplacements (85 % des emplacements ), A ou B: \nA: Angle de parking entre 76 – 90 degrés\n(2.25m = -5, 2.30m = 0, 2.35m = 2, 2.40m = 4, 2.45m = 6, 2.50m = 8) \nB: Angle de parking entre 45-75 degrés\n(2.25m = -5, 2.30m = 1, 2.35m = 3, 2.40m = 5, 2.45m = 8)\nLa largeur de 2.25m est uniquement applicable  pour d’anciens parkings rénovés, les nouveaux parkings doivent presenter une largeur minimum de 2.30m","Stellplatzbreite (85 % der Stellplätze), A oder B: \nA: Aufstellwinkel zwischen 76 – 90 Grad\n(2.25m = -5, 2.30m = 0, 2.35m = 2, 2.40m = 4, 2.45m = 6, 2.50m = 8) \nB: Aufstellwinkel zwischen 45-75 degrés\n(2.25m = -5, 2.30m = 1, 2.35m = 3, 2.40m = 5, 2.45m = 8)\nDie Breite von 2.25m ist nur bei über 10 Jahre alten renovierten Parkhäusern zulässig. Neue Parkhäuser müssen eine Stellplatzbreite von mindestens 2.30m aufweisen.","Ancho de plazas (85 % de las plazas), A o B: \nA: Ángulo 76 – 90 grados\n(2.25m = -5, 2.30m = 0, 2.35m = 2, 2.40m = 4, 2.45m = 6, 2.50m = 8) \nB: Ángulo 45-75 grados\n(2.25m = -5, 2.30m = 1, 2.35m = 3, 2.40m = 5, 2.45m = 8)\nEl ancho de 2.25m únicamente es aplicable a aparcamientos renovados, los aparcamientos nuevos deben tener un ancho mínimo de 2.30m","Largura dos lugares (85% dos lugares), A ou B:\nA: Ângulo Estacionamento 76 - 90 graus\n(2.25m = -5, 2.30m = 0, 2.35m = 2, 2.40m = 4, 2.45m = 6, 2.50m = 8) \nB: Ângulo Estacionamento 45-75 graus\n(2.25m = -5, 2.30m = 1, 2.35m = 3, 2.40m = 5, 2.45m = 8)\nA largura de 2,25m aplica-se apenas para os parques de estacionamento renovados, novos parques de estacionamento devem ter no mínimo 2,30m "]
[90,"Total unit measure of one way isle width and\rdepth of two parking bays, depending on parking angle and bay width:\rBay width: 2.50m / 2.45m / 2.40m / 2.35m / 2.30m\r90° :           16.00 /  16.30 /  16.60 /  16.90 / 17.30\r85° :           15.70 /  16.00 /  16.30 /  16.60 / 16.95\r80° :           15.40 /  15.70 /  16.00 /  16.30 / 16.60\r75° :           14.95 /  15.25 /  15.55 /  15.85 / 16.15\r70° :           14.50 /  14.80 /  15.10 /  15.40 / 15.70\r65° :           14.40 /  14.40 /  14.55 /  14.80 / 15.10\r60° :           14.30 /  14.30 /  14.30 /  14.30 / 14.50\r55° :           14.00 /  14.00 /  14.00 /  14.00 / 14.10\r50° :           13.75 /  13.75 /  13.75 /  13.75 / 13.75\r45° :           13.50 /  13.50 /  13.50 /  13.50 / 13.50\r\rTotal unit measure as above qualifies for 3 points. \rUp to 30 cm less qualifies for 2 points\rUp to 60 cm less qualifies for 1 point\rMore than 60 cm less: no points given",90,"Total unit measure of one way isle width and\ndepth of two parking bays, depending on parking angle and bay width:\nBay width: 2.50m / 2.45m / 2.40m / 2.35m / 2.30m\n90° :           16.00 /  16.30 /  16.60 /  16.90 / 17.30\n85° :           15.70 /  16.00 /  16.30 /  16.60 / 16.95\n80° :           15.40 /  15.70 /  16.00 /  16.30 / 16.60\n75° :           14.95 /  15.25 /  15.55 /  15.85 / 16.15\n70° :           14.50 /  14.80 /  15.10 /  15.40 / 15.70\n65° :           14.40 /  14.40 /  14.55 /  14.80 / 15.10\n60° :           14.30 /  14.30 /  14.30 /  14.30 / 14.50\n55° :           14.00 /  14.00 /  14.00 /  14.00 / 14.10\n50° :           13.75 /  13.75 /  13.75 /  13.75 / 13.75\n45° :           13.50 /  13.50 /  13.50 /  13.50 / 13.50\n\nTotal unit measure as above qualifies for 3 points. \nUp to 30 cm less qualifies for 2 points\nUp to 60 cm less qualifies for 1 point\nMore than 60 cm less: no points given","Totale maat van rijstrook voor éénrichtingsverkeer plus twee vakdieptes, afhankelijk van parkeerhoek en vakbreedte:  \nVakbreedte2.50m / 2.45m / 2.40m / 2.35m / 2.30m \n90° :           16.00 /  16.30 /  16.60 /  16.90 / 17.30\n85° :           15.70 /  16.00 /  16.30 /  16.60 / 16.95\n80° :           15.40 /  15.70 /  16.00 /  16.30 / 16.60\n75° :           14.95 /  15.25 /  15.55 /  15.85 / 16.15\n70° :           14.50 /  14.80 /  15.10 /  15.40 / 15.70\n65° :           14.40 /  14.40 /  14.55 /  14.80 / 15.10\n60° :           14.30 /  14.30 /  14.30 /  14.30 / 14.50\n55° :           14.00 /  14.00 /  14.00 /  14.00 / 14.10\n50° :           13.75 /  13.75 /  13.75 /  13.75 / 13.75\n45° :           13.50 /  13.50 /  13.50 /  13.50 / 13.50\n\nBovenstaande maat geeft 3 punten. \nTot 30 cm minder geeft 2 punten \nTot 60 cm minder geeft 1 punt\nMeer dan 60cm minder: geen punten","Métrage total d’une surface constituée de  un emplacement, une voie de circulation et un emplacement (en fonction de la largeur et de la profondeur des emplacements) :\nLargeur des emplacements: 2.50m / 2.45m / 2.40m / 2.35m / 2.30m\n90° :           16.00 /  16.30 /  16.60 /  16.90 / 17.30\n85° :           15.70 /  16.00 /  16.30 /  16.60 / 16.95\n80° :           15.40 /  15.70 /  16.00 /  16.30 / 16.60\n75° :           14.95 /  15.25 /  15.55 /  15.85 / 16.15\n70° :           14.50 /  14.80 /  15.10 /  15.40 / 15.70\n65° :           14.40 /  14.40 /  14.55 /  14.80 / 15.10\n60° :           14.30 /  14.30 /  14.30 /  14.30 / 14.50\n55° :           14.00 /  14.00 /  14.00 /  14.00 / 14.10\n50° :           13.75 /  13.75 /  13.75 /  13.75 / 13.75\n45° :           13.50 /  13.50 /  13.50 /  13.50 / 13.50\n\nUn métrage total supérieur aux cotes ci-dessus donne droit à 3 points. \nJusqu’à 30 cm de moins donne droit à 2 points\nJusqu’à 60 cm de moins donne droit à 1 point\nPlus de  60 cm en moins: pas de points attribués","Parkgassenbreite  (Fahrbahn plus 2 Stellplätze) in Abhängigkeit der Stellplatzbreite und des Aufstellwinkels:\nStellplatzbreite: 2.50m / 2.45m / 2.40m / 2.35m / 2.30m\n90° :                   16.00 /  16.30 /  16.60 /  16.90 / 17.30\n85° :                   15.70 /  16.00 /  16.30 /  16.60 / 16.95\n80° :                   15.40 /  15.70 /  16.00 /  16.30 / 16.60\n75° :                   14.95 /  15.25 /  15.55 /  15.85 / 16.15\n70° :                   14.50 /  14.80 /  15.10 /  15.40 / 15.70\n65° :                   14.40 /  14.40 /  14.55 /  14.80 / 15.10\n60° :                   14.30 /  14.30 /  14.30 /  14.30 / 14.50\n55° :                   14.00 /  14.00 /  14.00 /  14.00 / 14.10\n50° :                   13.75 /  13.75 /  13.75 /  13.75 / 13.75\n45° :                   13.50 /  13.50 /  13.50 /  13.50 / 13.50\n\nBreiten wie oben aufgeführt erhalten 3 Punkte. \nBreiten bis zu 30 cm weniger erhalten 2 Punkte\nBreiten bis zu 60 cm weniger erhalten 1 Punkte\nÜber 60 cm weniger: 0 Punkte\n","Anchura total de un aparcamiento de sentido único con estacionamiento a ambos lados, en función del ángulo y el ancho de plaza\nAncho plaza: 2.50m / 2.45m / 2.40m / 2.35m / 2.30m\n90° :                 16.00 /  16.30 /  16.60 /  16.90 / 17.30\n85° :                 15.70 /  16.00 /  16.30 /  16.60 / 16.95\n80° :                 15.40 /  15.70 /  16.00 /  16.30 / 16.60\n75° :                 14.95 /  15.25 /  15.55 /  15.85 / 16.15\n70° :                 14.50 /  14.80 /  15.10 /  15.40 / 15.70\n65° :                 14.40 /  14.40 /  14.55 /  14.80 / 15.10\n60° :                 14.30 /  14.30 /  14.30 /  14.30 / 14.50\n55° :                 14.00 /  14.00 /  14.00 /  14.00 / 14.10\n50° :                 13.75 /  13.75 /  13.75 /  13.75 / 13.75\n45° :                 13.50 /  13.50 /  13.50 /  13.50 / 13.50\n\nAnchura total igual o superior al valor de arriba obtiene 3 puntos. \nHasta 30 cm menos obtiene 2 puntos\nHasta 60 cm menos obtiene 1 punto\nMás de 60 cm menos: 0 puntos","Medida total de uma ilha com um lugar de largura e dois lugares de profundidade de dois lugares, dependendo do ângulo de estacionamento e largura do lugar:\nLargura do lugar: 2.50m / 2.45m / 2.40m / 2.35m / 2.30m\n90° :           16.00 /  16.30 /  16.60 /  16.90 / 17.30\n85° :           15.70 /  16.00 /  16.30 /  16.60 / 16.95\n80° :           15.40 /  15.70 /  16.00 /  16.30 / 16.60\n75° :           14.95 /  15.25 /  15.55 /  15.85 / 16.15\n70° :           14.50 /  14.80 /  15.10 /  15.40 / 15.70\n65° :           14.40 /  14.40 /  14.55 /  14.80 / 15.10\n60° :           14.30 /  14.30 /  14.30 /  14.30 / 14.50\n55° :           14.00 /  14.00 /  14.00 /  14.00 / 14.10\n50° :           13.75 /  13.75 /  13.75 /  13.75 / 13.75\n45° :           13.50 /  13.50 /  13.50 /  13.50 / 13.50\n\nSe igual ou superior ao valor da tabela acima, 3 pontos.\nAté 30 cm menos, 2 pontos\nAté 60 cm menos,  1 ponto\nMais de 60 cm a menos: 0 pontos."]
[91,"Kerb design to avoid damage to average vehicle’s wheels\r•  Yes = 2, No protection = 0",91,"Kerb design to avoid damage to average vehicle’s wheels\n•  Yes = 2, No protection = 0","Stoeprand met schuine kant ter bescherming van banden en velgen \n• Ja = 2, Nee =  0","Bordures conçues pour éviter des dommages aux jantes\n•  Oui = 2, Pas de protection = 0","Bauliche Ausbildung der Schrammborde zum Schutz vor Beschädigungen der Reifen und Felgen:\n•  Ja = 2, kein Schutz = 0","Diseño de bordillos para evitar daños en las ruedas de un vehículo estándar\n•  Sí = 2, Sin protección = 1","Guias para evitar danos às rodas dos veículos\n•  Sim = 2, Sem proteção = 0"]
[92,"Vehicle Ramps",92,"Vehicle Ramps","Hellingbanen","Rampes pour véhicules","Fahrzeugrampen","Rampas para vehículos","Rampas de Veículos"]
[93,"Is this a Single level car park without vehicular ramps or ramper floor?",93,"Is this a Single level car park without vehicular ramps or ramper floor?","Een garage met één parkeerlaag zonder hellingbanen of hellende parkeervloer krijgt standaard 10 punten. Is dit het geval?","S’agit-il d’un parking d’un seul niveau sans rampe pour voitures ou de surface en pente?","Handelt es sich um ein 1-geschossiges Parkhaus ohne Rampen oder geneigte Parkebenen?","Se trata de un aparcamiento de una única planta sin rampas para vehículos o un aparcamiento en superficie?","É um parque de estacionamento de um único piso, sem rampas ou níveis de estacionamento inclinados?"]
[94,"Ramp surface between parking areas (Anti slip 1, Smooth 0, no ramps 1)",94,"Ramp surface between parking areas (Anti slip 1, Smooth 0, no ramps 1)","Hellingbanen tussen parkeervloeren\n• Ruw = 1, Glad = 0, N.v.t. = 1","Surface des rampes entre les étages de stationnement ( Anti dérapant 1; Lisse 0, Pas de rampes 1)","Oberflächenausbildung der Rampe zwischen den Parkebenen (rutschhemmend 1; glatt 0, keine Rampen 1)","Superficie de las rampas entre plantas del aparcamiento (Antideslizante 1, Lisa 0, sin rampas 1)","Superfície da rampa entre áreas de estacionamento (Antiderrapante 1, Liso 0, sem rampas 1)"]
[95,"Ramp longitudinal gradient connecting ramps (not used for parking)\r•  <10%=3, 10-15%=1, >15%=0, no ramps=3",95,"Ramp longitudinal gradient connecting ramps (not used for parking)\n•  <10%=3, 10-15%=1, >15%=0, no ramps=3","Hellingbanen tussen parkeervloeren (waarop niet wordt geparkeerd)\n• <10% =3, 10 -15% =1, > 15% =0, geen = 3","L’inclinaison longitudinale des rampes est-elle de (pour rampes non utilisées pour le stationnement)\n•  <10%=3, 10-15%=1, >15%=0, pas de rampes=3","Gefälle der Geschoßverbindungsrampen (keine Parkrampen)\n•  <10%=3, 10-15%=1, >15%=0, keine Rampen=3","Pendiente longitudinal en rampas (no usadas para aparcamiento)\n•  <10%=3, 10-15%=1, >15%=0, sin rampas=4","A inclinação longitudinal das rampas é (não utilizado para estacionamento)\n•  <10%=3, 10-15%=1, >15%=0, sem rampas=3"]
[96,"Ramp width (between kerbs) all ramps measured at narrowest point ",96,"Ramp width (between kerbs) all ramps measured at narrowest point ","Breedte van rechte hellingbanen (tussen stoepranden) op het smalste punt","Largeur des rampes ( entre les bordures), toutes les rampes étant mesurées aux points les plus étroits","Rampenbreite (zwischen Schrammborden), gemessen am engsten Punkt der Rampen","Anchura de rampas (entre bordillos), medida en el punto más estrecho","Largura da rampa, entre guias. Todas as rampas medidas no ponto mais estreito."]
[97,"Curved ramps must be 1 m wider for same score. Are the ramps curbed?",97,"Curved ramps must be 1 m wider for same score. Are the ramps curbed?","Hellingbanen in een bocht? \n• moeten 1 m breder zijn voor dezelfde score. ","Les rampes courbes doivent  être 1m plus larges pour obtenir le même score. Les rampes sont-elles courbes ?","Gekrümmte Rampen müssen für dieselbe Punktzahl um 1m breiter sein? Sind die Rampen gekrümmt?","Las rampas curvas deben ser 1 m más anchas para obtener la misma puntuación. Las rampas son curvas?","As rampas curvas devem ser 1m de largura adicional para conseguir a mesma pontuação. As rampas são curvas?"]
[98,"Please choose width. < 3m=0, 3-3.3m=1, >3.3m=2, no ramps=2",98,{"$f":"CONCATENATE(\"Please choose width. \",IF(rampsCurved=yes,\"< 4m=0, 4-4.3m=1, >4.3m=2, no ramps=2\",\"< 3m=0, 3-3.3m=1, >3.3m=2, no ramps=2\"))","v":"Please choose width. < 3m=0, 3-3.3m=1, >3.3m=2, no ramps=2"},"Kies breedte van de hellingbaan: < 3m=0, 3-3.3m=1, >3.3m=2",{"$f":"CONCATENATE(\"Largeur \",IF(rampsCurved=yes,\"< 4m=0, 4-4.3m=1, >4.3m=2, pas de rampe=2\",\"< 3m=0, 3-3.3m=1, >3.3m=2, pas de rampe=2\"))","v":"Largeur < 3m=0, 3-3.3m=1, >3.3m=2, pas de rampe=2"},"Breite < 3m=0, 3-3.3m=1, >3.3m=2, keine Rampen=2",{"$f":"CONCATENATE(\"Elegir el ancho \",IF(rampsCurved=yes,\"< 4m=0, 4-4.3m=1, >4.3m=2, sin rampas=2\",\"< 3m=0, 3-3.3m=1, >3.3m=2, sin rampas=2\"))","v":"Elegir el ancho < 3m=0, 3-3.3m=1, >3.3m=2, sin rampas=2"},{"$f":"CONCATENATE(\"Selecionar a Largura \",IF(rampsCurved=yes,\"< 4m=0, 4-4.3m=1, >4.3m=2, sem rampas=2\",\"< 3m=0, 3-3.3m=1, >3.3m=2, sem rampas=2\"))","v":"Selecionar a Largura < 3m=0, 3-3.3m=1, >3.3m=2, sem rampas=2"}]
[99,"Ramp curvature (external radius) curved ramps\r•  up to 9m=0, 9–10 m=1, >10m=2, no ramps=2\rAt dual way ramps this measure refers to the inner lane.",99,"Ramp curvature (external radius) curved ramps\n•  up to 9m=0, 9–10 m=1, >10m=2, no ramps=2\nAt dual way ramps this measure refers to the inner lane.","Straal buitenkant van gebogen hellingbanen:\n• < 9m =0,  9 – 10 m =1, > 10m  = 2, \nBij hellingbanen voor twee richtingen geldt deze maat voor de binnenste rijstrook.","Rayon de courbure des rampes courbes ( radius externe)\n•  jusqu’à  9m=0, 9–10 m=1, >10m=2, pas de rampes=2\nPour une rampe à double sens, cette mesure se réfère à la voie intérieure.","Rampenradius (Außenradius)\n•  bis 9m=0, 9–10 m=1, >10m=2, keine Rampen=2\nBei mehrspurigen Rampen gelten diese Angaben für die innere Spur.","Curvatura de la rampa (radio exterior)\n•  hasta 9m=0, 9–10 m=1, >10m=2, sin rampas=2\nEn rampas de doble dirección, la medida hace referencia al carril interior.","Raio de curvatura da rampa (raio externo)\n•  até 9m=0, 9–10 m=1, >10m=2, sem rampas=2\nNas vias com rampas duplas esta medida refere-se à faixa interior."]
[100,"Approach curve to straight ramps\r•  <7.5m=0, 7.5–9m=1, >9m=2, no ramps=2",100,"Approach curve to straight ramps\n•  <7.5m=0, 7.5–9m=1, >9m=2, no ramps=2","Straal buitenkant aanrijbocht naar een rechte hellingbaan:\n• <7.5m =0,  7.5 – 9m =1, > 9m  = 2","Courbe d’approche d’une rampe d’accès\n•  <7.5m=0, 7.5–9m=1, >9m=2, pas de rampe=2","Eingangskurve zu geraden Rampen\n•  <7.5m=0, 7.5–9m=1, >9m=2, keine Rampen=2","Curva de aproximación a rampas rectas\n•  <7.5m=0, 7.5–9m=1, >9m=2, sin rampas=3","Curva de abordagem para rampas retas\n•  <7.5m=0, 7.5–9m=1, >9m=2, sem rampas=2"]
[101,"Ramped parking floor longitudinal gradient\r•  <5%=3, 5-7 =1, >7%=0, no gradient=3",101,"Ramped parking floor longitudinal gradient\n•  <5%=3, 5-7 =1, >7%=0, no gradient=3","Hellende parkeervloeren:\n• <5% =3, 5-7% =1, >7% =0, vlakke vloer = 3","Inclinaison longitudinale d’une rampe pourvue d’emplacements de parking\n•  <5%=3, 5-7 =1, >7%=0, pas d’inclinaison=3","Gefälle von Parkrampen (geneigte Parkebenen)\n•  <5%=3, 5-7 =1, >7%=0, kein Gefälle =3","Pendiente longiitudinal de planta de aparcamiento en pendiente\n•  <5%=3, 5%-7% =1, >7%=0, sin pendiente=4","Inclinação das rampas de estacionamento.\n•  <5%=3, 5-7 =1, >7%=0, sem inclinação=3"]
[102,"Pedestrian Access",102,"Pedestrian Access","Toegankelijkheid voor voetgangers","Accès piétons","Fußgängereingang","Accesos peatonales","Acessos Pedonais"]
[103,"Item List",103,"Item List","Omschrijving","Description","Positionsliste","Lista de elementos","Lista de Itens"]
[104,"Headroom for pedestrians - excluding doors\r• <2.00m = 0\r• 2.00m – 2.10m = 1\r• 2.10m – 2.20m = 2\r• > 2.20m = 3",104,"Headroom for pedestrians - excluding doors\n• <2.00m = 0\n• 2.00m – 2.10m = 1\n• 2.10m – 2.20m = 2\n• > 2.20m = 3","Hoogte voor voetgangers op de looproutes op de parkeervloer (excl. Deuren)\n• 1,90 – 2,00 m = 0\n• 2,00 – 2,10 m = 1\n• 2,10 – 2,20 m = 2\n• > 2,20 m = 3","Hauteur de plafond zones piétonnes ( portes exceptées)\n(<2.00m = 0, 2.00m – 2.10m = 1, 2.10m – 2.20m = 2, > 2.20m = 3)","Durchgangshöhe für Fußgänger (Türen ausgenommen)\n(<2.00m = 0, 2.00m – 2.10m = 1, 2.10m – 2.20m = 2, > 2.20m = 3)","Altura libre para peatones - excluyendo las puertas\n• <2.00m = 0\n• 2.00m – 2.10m = 1\n• 2.10m – 2.20m = 2\n• > 2.20m = 4","Pé direito nas zonas pedonais  - excluindo portas\n• <2.00m = 0\n• 2.00m – 2.10m = 1\n• 2.10m – 2.20m = 2\n• > 2.20m = 4"]
[105,"Separate walking route (i.e. heightened; zebra stripes or colours) (yes = 2, no = 0)",105,"Separate walking route (i.e. heightened; zebra stripes or colours) (yes = 2, no = 0)","Gescheiden looproute ( bv verhoogd, zebra of afwijkende kleur)\n• ja = 2, nee = 0","Voies piétonnes séparées (par ex: surélevées, marquages passages piétons ,utilisation couleur) (oui = 2, non = 0)","Ausgewiesene Fußwege (z.B.: baulich erhöht, Zebrastreifen oder farbig) (ja = 2, nein = 0)","Ruta peatonal separada (por ejemplo, sobreelevada; marcas horizontales o colores) (sí = 2, no = 0)","Via pedonal separada (pe, passeios, passadeiras ou faixas coloridas) (sim = 2, não = 0)"]
[106,"Are pedestrian entrance doors easy to use?\r(Yes, automatic or open connection = 4, Easy to open = 2, No = 0)",106,"Are pedestrian entrance doors easy to use?\n(Yes, automatic or open connection = 4, Easy to open = 2, No = 0)","Zijn deuren gemakkelijk te openen?\n• Ja: automatisch of open verbinding = 4\n• Gemakkelijk te openen = 2\n• Nee = 0","Les portes pour piétons sont-elles facile à utiliser?\n(Oui, portes automatiques ou passage ouvert = 4, Facile à ouvrir = 2, No = 0)","Sind die Türen für Fußgänger leicht zu öffnen ?\n(Ja, Automatiktüren oder offene Verbindung = 4, leicht zu öffnen = 2, nein = 0)","Las puertas peatonales son de fácil uso?\n(Sí, automáticas o paso abierto = 4, Apertura fácil = 2, No = 0)","As portas das entradas para peões são fáceis de usar?\n(Sim, automática ou aberta = 4, Fácil de abrir = 2, Não = 0)"]
[107,"Pedestrian access controlled by ticket/pass card when car park open (Yes=1, No=0)",107,"Pedestrian access controlled by ticket/pass card when car park open (Yes=1, No=0)","Voetgangerstoegang met kaartlezer tijdens openingsuren \nJa=1, Nee=0","Accès piétons contrôlés par lecteurs de tickets/cartes durant les heures d’ouverture  (Oui=2,Non=0)","Ist der Fußgängereingang auch während der Öffnungszeiten mit einem Kartenleser gesichert ? (Ja=2,Nein=0)","Acceso peatonal controlado vía ticket/tarjeta en horario de apertura del aparcamiento (Sí=1, No=0)","Acesso pedonal controlado por bilhete/cartão de passe quando parque de estacionamento aberto (Sim=1, Não=0)"]
[108,"City plan a central location in car park:\r(On Every pedestrian exit = 2, One location = 1, No = 0)",108,"City plan a central location in car park:\n(On Every pedestrian exit = 2, One location = 1, No = 0)","Stadsplattegrond op centrale plek in de garage: \n• Bij elke voetgangersuitgang=2, op één plek = 1, nee = 0","Plan de ville affiché à un endroit de passage:\n(A chaque sortie piétonne= 2, A un endroit = 1, Non = 0)","Liegt ein Stadtplan an einem zentralen Punkt des Parkhauses aus ?:\n(An jedem Fußgängerausgang= 2, An einer anderen Stelle = 1, Nein = 0)\n","Plano de la ciudad City plan a central location in car park:\n(En todas las salidas peatonales = 2, Sólo en un lugar = 1, No = 0)","Plano da cidade numa localização central do parque de estacionamento:\n(Em cada saída pedonal = 2, Uma localização = 1, Não = 0)"]
[109,"Guidance:",109,"Guidance:","Bewegwijzering","Guidage","Wegweisung:","Guiado:","Orientação:"]
[110,"to key attractions around the car park at pedestrian exit (Yes=1, No=0):",110,"to key attractions around the car park at pedestrian exit (Yes=1, No=0):","Bewegwijzering bij voetgangersuitgang naar belangrijke bestemmingen\n• Ja = 1, Nee = 0","A la sortie piétons vers les principaux points d’attraction autour du parking  (Oui=1, Non=0):","Zu wichtigen Zielen außerhalb des Parkhauses (Ja=1, Nein=0):","hacia lugares turísticos alrededor del aparcamiento en las salidas peatonales (Sí=1, No=0):","Nas saídas de peões em torno do estacionamento, para os principais pontos de atração?  (Sim=1, Não=0):"]
[111,"around the car park to pedestrian entrances (Yes=1, No=0):",111,"around the car park to pedestrian entrances (Yes=1, No=0):","Bewegwijzering naar voetgangerstoegang \n• Ja = 1, Nee = 0","Aux alentours du parking vers les entrées piétonnes (Oui=1, Non=0):","In der Umgebung des Parkhauses zu den Eingängen (Ja=1, Nein=0):","alrededor del aparcamiento hacia los accesos peatonales (Sí=1, No=0):","Ao redor do parque de estacionamento para as entradas de peões? (Sim=1, Não=0):"]
[112,"Is this a Single level car park at ground floor, (not open surface) ?",112,"Is this a Single level car park at ground floor, (not open surface) ?","Een garage met één parkeerlaag op straatniveau zonder trappen of liften? ","Est-ce un parking sur un seul niveau en rez-de-chaussée, (pas à ciel ouvert)?","Handelt es sich um ein 1-geschossiges Parkhaus auf Erdgeschoßniveau (keine offener Parkplatz)?","Se trata de un aparcamiento de una única planta a nivel de calle (no en superficie)?","É um parque de estacionamento com um único piso térreo? (mas não de superficie aberta)"]
[113,"Is there elevators serving street level?",113,"Is there elevators serving street level?","Gaan de aanwezige liften tot straatniveau?","Y a-t-il des ascenseurs desservant le niveau rez-de-chaussée?","Fahren der/die Aufzüge das Erdgeschoß/Straßenniveau an?","Hay ascensores que conecten el nivel de calle?","Existem elevadores até ao nível da rua?"]
[114,"Number of Elevators at street level:\r(1 elevator = 1, 2 + elevators = 5)",114,"Number of Elevators at street level:\n(1 elevator = 1, 2 + elevators = 5)","Liften vanaf straatniveau\n• geen  = 0,  1 lift = 1, \n• 2 of meer liften =5","Nombre d’ascenseurs au niveau rez-de-chaussée:\n(1 ascenseur = 1, 2 ascenseurs ou + = 5)","Anzahl der Aufzüge, welche das Erdgeschoß/Straßenniveau  anfahren:\n(1 Aufzug = 1, 2 Aufzüge oder mehr = 5)","Número de ascensores a nivel de calle:\n(1 ascensor = 1, 2 o más ascensores = 5)","Número de Elevadores que servem o nível da rua:\n(1 elevador = 1, + 2 elevadores = 5)"]
[115,"Size of elevators:\r(More Than 8 people = 3, 4-8 people = 1, less than 4 = 0)",115,"Size of elevators:\n(More Than 8 people = 3, 4-8 people = 1, less than 4 = 0)","Capaciteit van de liften\n• > 8 personen = 3;  4-8 personen = 1; <4 personen  = 0","Taille des ascenseurs:\n(Plus de 8 personnes = 3, 4-8 personnes = 1, moins de 4 personnes= 0)","Größe der Aufzüge:\n(über 8 Personen = 3, 4-8 Personen = 1, weniger als 4 Personen= 0)","Tamaño de ascensores:\n(Más de 8 personas = 3, 4-8 personas = 1, menos de 4 = 0)","Capacidade dos elevadores:\n(Mais de 8 pessoas = 3, 4-8 pessoas = 1, menos que 4 = 0)"]
[116,"Visibility from elevator inside to hall/parking area\r(no visibility from elevator = 0, glazed doors/walls = 3, no elevator = 0)",116,"Visibility from elevator inside to hall/parking area\n(no visibility from elevator = 0, glazed doors/walls = 3, no elevator = 0)","Zicht vanuit lift naar hall of parkeervloeren\n• Geen zicht vanuit de lift = 0;\n• Deur met glas/glazen wand = 3; \n• Geen lift = 0","Visibilité depuis l’ascenseur vers le hall/parking\n(pas de visibilité depuis l’ascenseur = 0, portes/murs vitré(e)s = 3, pas d’ascenseur = 0)","Sichtverbindung zwischen Aufzug und Vorraum/Parkebene :\n(Keine Sichtverbindung = 0, Türen/Schachtwände verglast = 3, kein Aufzug = 0)","Visibilidad desde el interior del ascensor hacia el vestíbulo/zona de aparcamiento\n(no hay visibilidad desde el ascensor = 0, puertas y muros acristalados = 3, no hay ascensor = 0)","Visibilidade desde o elevador para o hall ou para a área de estacionamento:\n(nenhuma visibilidade do elevador = 0, portas de vidros/paredes = 3, sem elevador = 0)"]
[{"$f":"C120","v":117},"Level indication:",117,"Level indication:","Verdieping indicatie:","Indication de l’étage","Anzeige der Etage","Indicación de la planta:","Indicação do Piso ou Andar:"]
[118,"in elevator:",118,"in elevator:","in de lift:","Dans l’ascenseur","Im Aufzug","en el interior del ascensor:","no elevador:"]
[119,"in elevator foyer:",119,"in elevator foyer:","In de lifthal:","Dans le hall d’ascenseur","Im Aufzugvorraum","en el rellano del ascensor:","no hall de entrada do elevador:"]
[120,"Elevator control buttons at wheelchair height\r•  Yes = 1, Other = 0",120,"Elevator control buttons at wheelchair height\n•  Yes = 1, Other = 0","Liftbediening op rolstoelhoogte \n• Ja = 1,  Nee = 0","Les boutons des ascenseurs sont-ils à hauteur d’une chaise roulante\n•  Oui = 1, Autre = 0","Bedienelemente im Aufzug in behindertengerechter Höhe?\n•  Ja = 1, andere = 0","Los botones del ascensor están a una altura para silla de ruedas\n•  Sí = 1, Otros = 1","Botões de controle do elevador à altura da cadeira de rodas\n•  Sim = 1, Outro = 0"]
[121,"Doors directly to parking area",121,"Doors directly to parking area","Toegangsdeuren tot de parkeervloeren","Portes directement vers les aires de stationnement","Verbindungstüren zu den Parkebenen","Puertas directamente hacia zona de aparcamiento","As portas do elevador dão acesso direto à área de estacionamento "]
[122,"Width (<90 cm =0, >=90 cm = 2)",122,"Width (<90 cm =0, >=90 cm = 2)","Breedte <90 cm =0, >90 cm = 2","Largeur (<90 cm =0, >=90 cm = 2)","Lichte Breite (<90 cm =0, >=90 cm = 2)","Ancho (<90 cm =0, >=90 cm = 2)","Largura (<90 cm =0, >=90 cm = 2)"]
[123,"Emergency door, standard open (Yes=2, No= 0)",123,"Emergency door, standard open (Yes=2, No= 0)","Open verbinding = 2","Portes d’évacuation de secours, en position ouverte (électroaimant) (Oui=2, Non= 0)","Fluchttüren, standardmässig offen (ja=2, nein= 0)","Puertas de emergencia, abierta por defecto (Sí=2, No= 0)","Portas de emergência estão abertas? (Sim=2, Não= 0)"]
[124,"Visibility (Glazed door/wall = 3, No Glass = 0)",124,"Visibility (Glazed door/wall = 3, No Glass = 0)","Zichtbaarheid\n• Glazen deur/wand = 3, Niet doorzichtig = 0","Visibilité (Portes/murs vitrés)= 3, Pas de vitres = 0","Sichtbeziehung (verglaste Türen/Wände = 3, kein Glas = 0)","Visibilidad (Puerta/muro acristalado = 3, Sin cristal = 0)","Visibilidade (Porta ou Muro envidraçados = 3, Sem visibilidade = 0)"]
[125,"Are elevators the main vertical connection? (stairs only secondary or escape)",125,"Are elevators the main vertical connection? (stairs only secondary or escape)","Vormen liften de hoofdverbinding voor vertical verkeer (trappen alleen voor noodgevallen)? ","Les ascenseurs sont-ils le principal moyen d’accéder aux étages? (escaliers uniquement pour évacuation de secours ou secondaires)","Sind Aufzüge die wichtigste Geschoßverbindung? (Treppen nur zweitrangig oder zur Entfluchtung)","Son los ascensores la principal conexión vertical? (escaleras únicamente para evacuación en caso de emergencia o secundarias)","Os elevadores são a principal ligação vertical? (escadas apenas secundárias ou fuga)"]
[126,"Stairwells (visibility and orientation)",126,"Stairwells (visibility and orientation)","Trappenhuizen: overzicht en orientatie","Cages d’escaliers (visibilité et orientation)","Treppenhäuser (Übersichtlichkeit und Orientierung)","Núcleos de escaleras (visibilidad y orientación)","Caixas de Escadas (visibilidade e orientação)"]
[127,"Clear View (Yes = 1, No = 0, Irrelevant = 1)",127,"Clear View (Yes = 1, No = 0, Irrelevant = 1)","Duidelijk overzicht, geen dode hoeken\n• Ja = 1, Nee = 0","Vue dégagée (Oui = 1, Non = 0, Pas d’application= 1)","Übersichtlich  (ja= 1, nein = 0, unzutreffend = 1)","Vista despejada (Sí = 1, No = 0, No aplica = 1)","Vista limpa (Sim = 1, Não = 0, Irrelevante = 1)"]
[128,"Level Indication (Yes = 1, No = 0, Irrelevant = 1)",128,"Level Indication (Yes = 1, No = 0, Irrelevant = 1)","Indicatie van de verdieping\n• Ja = 1, Nee = 0","Indication d’étage (Oui = 1, Non = 0, Pas d’application = 1)","Geschoßkennzeichnung (ja = 1, nein = 0, unzutreffend = 1)","Indicación de planta (Sí = 1, No = 0, No aplica = 1)","Indicação do piso ou andar (Sim = 1, Não = 0, Irrelevante = 1)"]
[129,{"$f":"IF(ISBLANK(VLOOKUP(A132,$C$4:$V$9989,1+$A$1)),D132,VLOOKUP(A132,$C$4:$V$9989,1+$A$1))","v":"Stairs (incl. heightened visibility of steps)"},129,"Stairs (incl. heightened visibility of steps)","Trappen:","Escaliers (y compris visibilité renforcée des marches)","Treppen (einschließlich verbesserte Sichtbarkeit von Stufen)","Escaleras (incluye visibilidad reforzada de escalones)","Escadas (incl. maior visibilidade dos degraus)"]
[130,"Width (< 1.5 m = 0, > 1.5m = 2)",130,"Width (< 1.5 m = 0, > 1.5m = 2)","Breedte < 1.5 m = 0, > 1.5m = 2","Largeur (< 1.5 m = 0, > 1.5m = 2)","Breite (< 1.5 m = 0, > 1.5m = 2)","Ancho (< 1.5 m = 0, > 1.5m = 2)","Largura (< 1.5 m = 0, > 1.5m = 2)"]
[131,"Hand Rails (No hand rail =0, One Side = 1, Two sides=2)",131,"Hand Rails (No hand rail =0, One Side = 1, Two sides=2)","Geen handreling =0, Eén zijde = 1, Twee zijden=2","Main courante (Pas de main courante=0, D’un seul côté = 1, Des deux côtés=2)","Handläufe (Kein Handlauf = 0, einseitig = 1, beidseitig = 2)","Barandillas (Sin barandillas =0, Un lado = 1, Ambos lados=2)","Corrimão (Não tem corrimão = 0, Um lado = 1, Dois lados = 2)"]
[132,"Heightened visibility of steps for people with poor eyesight (Yes = 2, No = 0)",132,"Heightened visibility of steps for people with poor eyesight (Yes = 2, No = 0)","Extra markering van treden voor slechtzienden \n• Ja = 2, Nee = 0","Visibilité renforcée des marches pour personne souffrant d’une déficience de la vue (Oui = 2, Non = 0)","Verbesserte Sichtbarkeit von Stufen für Personen mit eingeschränkter Sehstärke (ja = 2, nein = 0)","Visibilidad reforzada de escalones para personas con deficiencias visuales (Sí = 2, No = 0)","Maior visibilidade dos degraus para pessoas com deficiência visual (Sim = 2, Não = 0)"]
[133,"Anti-slip surfacing on stairs: (Yes = 2, No = 0)",133,"Anti-slip surfacing on stairs: (Yes = 2, No = 0)","Anti-slip op trappen:\n• Ja = 2, Nee = 0","Surface anti-dérapante sur les marches (Oui = 2, Non = 0)","Rutschfester Belag auf den Stufen (ja = 2, nein = 0)","Superficie antideslizante en escaleras: (Sí = 2, No = 0)","Antiderrapante à superfície em escadas: (Sim = 2, Não = 0)"]
[134,"External openings in stairwell\r(window/grilled to outside or car park  =2, none =0)",{"$f":"C136+1","v":134},"External openings in stairwell\n(window/grilled to outside or car park  =2, none =0)","Daglicht toetreding in trappenhuis\n• Raam of rooster opening =2\n• geen  =0","Ouvertures extérieures des cages d’escalier\n(fenêtres ou grilles vers l’extérieur ou vers le parking  =2, Pas d’ouverture =0)","Öffnungen in Treppenhauswänden\n(Fenster oder vergitterte Öffnungen ins Freie oder zu den Parkebenen = 2, keine Öffnungen = 0)","Aperturas exteriores en el núcleo de escaleras\n(ventana/rejilla al exterior o aparcamiento =2, ninguna =0)","Aberturas externas nas Caixas de Escadas\n(janela / grelha para fora do parque de estacionamento =2, nenhum =0)"]
[135,"Security Equipment",135,"Security Equipment","Veiligheidstechniek","Equipements de sécurité","Sicherheitseinrichtungen","Herramientas de seguridad","Equipamentos de Segurança"]
[136,"Item List",136,"Item List","Omschrijving","Description","Positionsliste","Lista de elementos","Lista de Items"]
[137,"CCTV with notice at entrance = 3, No CCTV =0",137,"CCTV with notice at entrance = 3, No CCTV =0","• CCTV met aanduiding bij de inrit = 3, \n• Geen CCTV =0","Vidéosurveillance avec affichage légal à l’entrée = 3, Pas de vidéosurveillance=0","Videoüberwachung mit Ankündigung am Eingang = 3, Keine Videoüberwachung = 0","CCTV con aviso a la entrada = 3, No hay CCTV =0","CCTV com aviso na entrada = 3, Não tem CCTV = 0"]
[138,"Staff surveillance (on-site or remote)\r•  Yes = 5, No = 0",138,"Staff surveillance (on-site or remote)\n•  Yes = 5, No = 0","Toezicht door personeel (ter plaatse of op afstand) \n• Ja = 5, Nee =  0","Sous surveillance par du personnel (sur site ou à distance)\n•  Oui = 5, No = 0","Überwachung durch Personal (vor Ort oder durch Fernüberwachung)\n•  ja = 5, nein = 0","Personal de vigilancia (presencial o remoto)\n•  Sí = 5, No = 1","Presença de Staff (no local ou remoto)\n•  Sim = 5, Não = 0"]
[139,"CCTV at:",139,"CCTV at:","CCTV bij:","Vidéosurveillance","Videoüberwachung an besonderen Stellen","CCTV en:","CCTV em:"]
[140,"Car Entry: Yes =1, No =0",140,"Car Entry: Yes =1, No =0","Inrit:  Ja =1, Nee =0","Entrées voitures: Oui =1, Non =0","Einfahrt: ja = 1, nein = 0","Entrada de vehículos: Sí =1, No =0","Entrada de Veículos: Sim =1, Não =0"]
[141," Car Exit: Yes =1, No =0",141," Car Exit: Yes =1, No =0","Uitrit:  Ja =1, Nee =0","Sorties voitures: Oui =1, Non =0","Ausfahrt: ja = 1, nein = 0","Salida de vehículos: Sí =1, No =0","Saída de Veículos: Sim =1, Não =0"]
[142,"Pay Machine: Yes =1, No =0",142,"Pay Machine: Yes =1, No =0","Betaalautomaat:  Ja =1, Nee =0","Bornes de paiement: Oui =1, Non =0","Kassenautomat: ja = 1, nein = 0","Máquina de pago: Sí =1, No =0","Máquina Pagamento: Sim =1, Não =0"]
[143,"Elevator Hall, every level: Yes =1, No =0",143,"Elevator Hall, every level: Yes =1, No =0","Voetgangers/lifthal op elke verdieping:  Ja =1, Nee =0","Hall d’ascenseurs, tous les étages: Oui =1, Non =0","Aufzugvorraum, in allen Geschossen: ja = 1, nein = 0","Vestíbulo de ascensor, en cada planta: Sí =1, No =0","Hall do Elevador, todos os níveis: Sim =1, Não =0"]
[144,"Stairwells, every level: Yes =1, No =0",144,"Stairwells, every level: Yes =1, No =0","Trappenhuizen op elke verdieping:  Ja =1, Nee =0","Cages d’escalier, chaque niveau: Oui =1, Non =0","Treppenhäuser, in allen Geschossen: ja = 1, nein = 0","Núcleo de escaleras, en cada planta: Sí =1, No =0","Caixa de escadas, todos os níveis: Sim =1, Não =0"]
[145,"Pedestrian Entrances: Yes =1, No =0",145,"Pedestrian Entrances: Yes =1, No =0","Voetgangerstoegang:  Ja =1, Nee =0","Entrées piétons: Oui =1, Non =0","Fußgängereingang: ja = 1, nein = 0","Accesos peatonales: Sí =1, No =0","Entradas Pedonais: Sim =1, Não =0"]
[146,"Most of Parking Area (65%):Yes =3, No =0",146,"Most of Parking Area (65%):Yes =3, No =0","Parkeervloeren 65%: Ja =3, Nee =0","La plupart des aires de stationnement (65%):Oui =3, Non =0","Überwiegender Teil der Parkebenen (65%): ja = 3, nein = 0","Mayor parte de la zona de aparcamiento (65%):Sí =3, No =0","Maioria da Área de Estacionamento (65%):Sim =3, Não =0"]
[147," Ramps: Yes = 1, No = 0",147," Ramps: Yes = 1, No = 0","Hellingbanen:  Ja = 1, Nee = 0","Rampes: Oui = 1, Non = 0","Rampen: ja = 1, nein = 0"," Rampas: Sí = 1, No = 0","Rampas: Sim = 1, Não = 0"]
[148,"Staff contactable via:",148,"Staff contactable via:","Assistentie oproepbaar via:","Personnel joignable via:","Personal kontaktierbar durch:","Personal localizable a través de:","Staff contactável via:"]
[149,"Intercom at pay machine and/or controlled entries (24/7=3, All access hours if not 24/7= 2, Part time/not available = 0)",149,"Intercom at pay machine and/or controlled entries (24/7=3, All access hours if not 24/7= 2, Part time/not available = 0)","Intercom bij betaalautomaat, slagbomen etc \n• 24 uur/7 dagen per week=3 \n• Openingsuren indien niet 24/7= 2 \n• Niet of onduidelijk = 0","Interphonie aux bornes de paiement et/ou aux entrées contrôlées (24h/24 7j/7=3, Durant les heures d’ouverture si pas 24h/24= 2, Partiellement ou absent = 0)","Sprechstellen an den Kassenautomaten und/oder an den kontrollierten Zugängen (24h/7=3, während der Öffnungszeiten wenn nicht 24h/24 = 2, zeitweise oder gar nicht = 0)","Interfonía en la máquina de pago y/o accesos controlados (24/7=3, Todas las horas de apertura si no 24/7= 2, Tiempo parcial/no disponible = 0)","Intercomunicador na máquina de pagamento e/ou entradas controladas (24/7=3, Todas as horas de acesso, se não 24/7= 2, Part-time/não disponível = 0)"]
[150,"Emergency call system in parking area (24/7=3, All access hours if not 24/7= 2, Part time/not available = 0)",150,"Emergency call system in parking area (24/7=3, All access hours if not 24/7= 2, Part time/not available = 0)","Noodoproep op de parkeervloeren\n• 24 uur/7 dagen per week=3 \n• Openingsuren indien niet 24/7= 2 \n• Niet of onduidelijk = 0","Système d’appel d’urgence dans les aires de stationnements (24h/24 7j/7=3, Durant les heures d’ouverture si pas 24h/24= 2, Partiellement ou absent = 0)","Notrufmelder in den Parkebenen (24/7 = 3, während der Öffnungszeiten wenn nicht 24/7 = 2, zeitweise oder gar nicht = 0)","Sistema de aviso de emergencia en zona de aparcamiento (24/7=3, Todas las horas de apertura si no 24/7= 2, Tiempo parcial/no disponible = 0)","Sistema de chamada de emergência na área de estacionamento (24/7=3, Todas as horas de acesso, se não 24/7= 2, Part-time/não disponível = 0)"]
[151,"Recognizable staff present and patrolling car park\r(24/7 = 3, During access Hours = 2, Less than access Hours = 1, No = 0)",151,"Recognizable staff present and patrolling car park\n(24/7 = 3, During access Hours = 2, Less than access Hours = 1, No = 0)","Herkenbaar toeziend personeel in de garage\n• 24 uur/7 dagen per week=3 \n• Openingsuren indien niet 24/7= 2 \n• Af en toe = 1\n• Niet = 0","Personnel présent, reconnaissable et patrouillant dans le parking\n(24h/24 7j/7 = 3, Durant toutes les heures d’ouverture = 2, Partiellement durant les heures d’ouverture  = 1, Indisponible = 0)","Patroullierendes Parkhauspersonal anwesend\n(24/7 = 3, während der Öffnungszeiten wenn nicht 24/7 = 1, gar nicht = 0)","Personal identificado presente y vigilando el aparcamiento\n(24/7 = 3, Durante horario de apertura = 2, Tiempo parcial = 1, No = 0)","Presença de pessoal do Staff fardado e patrulhamento do parque de estacionamento\n(24/7 = 3, Durante Horário de acesso = 2, Após Horário de acesso = 1, Não = 0)"]
[152,"Lockable vehicle exit/entry: \r(Closed gate/rolling shutter  after access hours = 2, Secured: fast opening gate during day = 4, Secured: slow opening gate during day = 2, No provisions = 0)",152,"Lockable vehicle exit/entry: \n(Closed gate/rolling shutter  after access hours = 2, Secured: fast opening gate during day = 4, Secured: slow opening gate during day = 2, No provisions = 0)","Afsluitbare in/uitrit\n• Hek of rolpoort na openingsuren= 2\n• Snelsluitend hek overdag= 4\n• Langzaam sluitend hek of rolpoort overdag= 2\n• Geen afsluiting= 0","Fermeture des entrées/sorties véhicules: \n(Portails ou volets fermés après heures d’ouverture = 2, Mécanisme de fermeture sécurisé rapide durant heures d’ouverture= 4, Mécanisme de fermeture sécurisé lent durant heures d’ouverture = 2, Pas de mécanisme = 0)","Verschließbare Ein-/Ausfahrten: \n(geschlossene Tore oder Rollgitter außerhalb der Öffnungszeiten = 2, Schnellauftore während der Öffnungszeiten = 4, langsam laufende Tore während der Öffnungszeiten = 2, keine Sicherung = 0)\n","Cierre de entrada/salida de vehículos: \n(Portón cerrado fuera de horario de apertura = 2, Mecanismo de seguridad de cierre rápido durante horario apertura = 4, Mecanismo de seguridad de cierre lento durante horario apertura = 2, Sin mecanismo = 0)","Saída/entrada de veículos bloqueável: \n(Portão fechado/portão de enrolar depois de horas de acesso = 2, seguro: rápida abertura do portão durante o dia = 4, seguro: portão de abertura lenta durante o dia = 2, Não previsto = 0)"]
[153,"Lockable pedestrian exit/entry (after opening hours).\r(Door/gate/rolling shutter <= 15cm maximum aperture = 2, over 15 cm = 0, no provisions = 0, Irrelevant (24 hours opening) = 2)",153,"Lockable pedestrian exit/entry (after opening hours).\n(Door/gate/rolling shutter <= 15cm maximum aperture = 2, over 15 cm = 0, no provisions = 0, Irrelevant (24 hours opening) = 2)","Afsluitbare voetgangerstoegang buiten openingtijd\n• Rolhek of deur met openingen < 15cm = 2\n• Rolhek of deur met grotere openingen= 0\n• Geen afsluiting= 0\n• Irrelevant (24 uur  opening) = 2","Fermeture des entrées/sorties piétons (après les heures d'ouverture).\n(Porte/portail/volet avec <= 15cm d’espace maximum entre barreaux = 2, au-delà de 15 cm = 0, Aucune disposition = 0, Pas d’application (ouverture 24h/24) = 2)","Verschließbare Ein-/Ausgänge außerhalb der Öffnungszeiten: \n(Türen, Tore oder Rollgitter mit Öffnungen <= 15 cm = 2, > 15 cm = 0, keine Sicherung = 0, unzutreffend (24 Stunden Öffnungszeit) = 2)","Cierre de entradas y salidas peatonales (fuera de horario de apertura).\n(Puerta/portón cuya apertura máxima es <= 15cm = 2, más de 15 cm = 0, ningún tipo de cierre = 0, No aplica (horario de apertura 24h) = 2)","Saída/entrada de caminhos pedonais (depois do horário de funcionamento).\n(Porta/portão/portão de enrolar <= 15cm abertura máxima = 2, mais de  15 cm = 0, não previsto = 0, Irrelevante (24 hours de abertura) = 2)"]
[154,"Grilles on external openings & security grilles\r(<= 15 cm = 2, > 15 cm or no protection= 0, Irrelevant (no external openings) = 2)",154,"Grilles on external openings & security grilles\n(<= 15 cm = 2, > 15 cm or no protection= 0, Irrelevant (no external openings) = 2)","Roosters in externe openingen & afsluithekken\n• <= 15 cm = 2, > 15 cm of geen rooster= 0","Grilles vers ouvertures extérieures & grilles de sécurité\n(<= 15 cm d’espace= 2, > 15 cm ou pas de  protection= 0, Pas d’application (pas d’ouvertures extérieures) = 2)","Vergitterung von Öffnungen nach außen\n(<= 15 cm = 2, > 15 cm oder kein Schutz= 0, unzutreffend (keine Öffnungen) = 2)","Rejillas en aperturas exteriores y rejillas de seguridad\n(<= 15 cm = 2, > 15 cm o sin protección= 0, No aplica (no hay aperturas exteriores) = 2)","Grelhas em aberturas externas e grades de segurança\n(<= 15 cm = 2, > 15 cm ou sem proteção= 0, Irrelevante (sem aberturas externas) = 2)"]
[155,"Wayfinding Inside and Outside",155,"Wayfinding Inside and Outside","Orientatie binnen en buiten de garage","Trouver son chemin dans et à l’extérieur du parking","Wegweisung innerhalb und außerhalb des Parkhauses","Orientación en interior y exterior del aparcamiento","Sinalética"]
[156,"Item List",156,"Item List","Omschrijving","Description","Positionsliste","Lista de elementos","Lista de Items"]
[157,"Identification of vacant parking spaces",157,"Identification of vacant parking spaces","Weergave vrije plaatsen","Identification des places libres","Anzeige von freien Stellplätzen","Identificación de plazas libres","Identificação de lugares de estacionamento vagos"]
[158,"Parking floor level (yes/good = 2, no/bad = 0)",158,"Parking floor level (yes/good = 2, no/bad = 0)","Op vloer niveau\n• Ja/goed = 2, nee/slecht = 0","Par étage (oui/bon = 2, non/mauvais= 0)","Etagenweise (ja/gut = 2, nein/schlecht= 0)","Por planta (sí/buena = 2, no/mala = 0)","Nível do piso de estacionamento (sim/bom = 2, não/mau = 0)"]
[159,"Parking row (yes/good = 1, no/bad = 0)",159,"Parking row (yes/good = 1, no/bad = 0)","Per parkeer rij\n• Ja/goed = 1, nee/slecht = 0","Par rangée (Oui/bon = 1, non/mauvais = 0)","Gassenweise (ja/gut = 1, nein/schlecht= 0)","Por fila (sí/buena = 1, no/mala = 0)","Por fila de estacionamento (sim/bom = 2 = 1, não/mau = 0)"]
[160,"Individual stall indication (yes/good = 2, no/bad = 0)",160,"Individual stall indication (yes/good = 2, no/bad = 0)","Per plaats\n• Ja/goed = 2, nee/slecht = 0","Par place individuelle (oui/bon= 2, non/mauvais = 0)","Platzweise (ja/gut = 2, nein/schlecht= 0)","Por plaza individual (sí/buena = 2, no/mala = 0)","Lugar a Lugar (sim/bom = 2, não/mau = 0)"]
[161,"Way finding (vehicles)",161,"Way finding (vehicles)","Orientatie vanuit de auto","Trouver son chemin au volant de son véhicule","Wegweisung für den fahrenden Verkehr","Orientación (vehículos)","Sinalética para veículos"]
[162,"Are floors clearly and separately identified for drivers? (Good =3, Adequate =2, Poor =1, No =0)",162,"Are floors clearly and separately identified for drivers? (Good =3, Adequate =2, Poor =1, No =0)","Is elke parkeerlaag duidelijk herkenbaar? \n• goed =3, acceptabel =2, matig =1, nee =0","Les étages sont-ils clairement et séparément identifiables pour le conducteur? (Bon =3, Adéquat =2, Faible =1, Non =0)","Sind die Etagen für den Fahrer klar und deutlich gekennzeichnet? (gut =3, befriedigend =2, schlecht =1, gar nicht =0)","Las plantas están claramente identificadas para los conductores? (Bien =3, Correcto =2, Mal =1, No =0)","Os pisos estão identificados de forma clara para os condutores? (Bom =3, Adequado =2, Pobre =1, Não =0)"]
[163,"Are sub-areas of floors clearly identified for drivers? (Good =3, Adequate =2, Poor =1, No =0)",163,"Are sub-areas of floors clearly identified for drivers? (Good =3, Adequate =2, Poor =1, No =0)","Zijn delen per parkeerlaag duidelijk gemarkeerd en herkenbaar?\n• goed =3, acceptabel =2, matig =1, nee =0","Les sous sections par étages sont-elles clairement identifiables pour le conducteur? (Bon=3, Adéquat =2, Faible=1, Non =0)","Sind einzelne Bereiche für den Fahrer klar und deutlich gekennzeichnet? (gut =3, befriedigend =2, schlecht =1, gar nicht =0)","Los sectores de cada planta están claramente identificados para los conductores? (Bien =3, Correcto =2, Mal =1, No =0)","As sub-áreas dos pisos estão identificadas de forma clara para os condutores? (Bom =3, Adequado =2, Pobre =1, Não =0)"]
[164,"Are fire escapes and escape routes clearly marked\r• Clear from all locations = 3\r• most locations= 2\r• some locations=1\r• No marking of escape routes=0)",164,"Are fire escapes and escape routes clearly marked\n• Clear from all locations = 3\n• most locations= 2\n• some locations=1\n• No marking of escape routes=0)","Zijn nooduitgangen en vluchtroutes duidelijk gemarkeerd? \n• Zichtbaar vanaf elke plek = 3\n• Zichtbaar vanaf de meeste plekken = 2\n• Zichtbaar vanaf sommige plekken =1\n• Geen aanduiding van vluchtroutes = 0","Les sorties de secours et les chemins d’évacuation sont-ils clairement identifiables\n(Clairement depuis tous les endroits= 3, depuis la plupart des endroits= 2, depuis certains endroits=1, Pas de signalisation des chemins d’évacuation=0)","Sind die Notausgänge und Rettungswege klar und deutlich gekennzeichnet?\n(an allen Standorten = 3, an den meisten Standorten = 2, nur an einigen Standorten = 1, keine Kennzeichnung der Rettungswege = 0)","Las salidas de emergencia en caso de incendio están debidamente señalizadas\n• Claramente desde cualquier ubicación = 3\n• La mayor parte de ubicaciones = 2\n• Algunas ubicaciones =1\n• No están señalizadas = 0)","As saídas de emergência e os caminhos de fuga estão claramente marcados\n• A partir de todos os locais = 3\n• maioria dos locais= 2\n• alguns locais=1\n• Sem identificação dos caminhos de fuga=0)"]
[165,"Are floor levels clearly marked?\r(good =3, adequate=2, poor=1, none =0. Single level car parks = 3)",165,"Are floor levels clearly marked?\n(good =3, adequate=2, poor=1, none =0. Single level car parks = 3)","Zijn verdiepingen duidelijk aangegeven?\n• goed =3, acceptabel=2\n• matig=1, geen =0\n• Garage met één verdieping = 3","Les étages sont-ils clairement marqués?\n(bon =3, adéquat=2, faible=1, absent=0. Parking d’un seul niveau = 3)","Sind die einzelnen Parkebenen klar und deutlich gekennzeichnet?\n(gut = 3, befriedigend = 2, schlecht = 1, gar nicht = 0., unzutreffend, da nur 1 Geschoss = 3)","Las plantas están claramente señalizadas?\n(bien =3, correcto=2, mal=1, ninguna señalización =0. Aparcamiento de una única planta = 3)","Os nívies dos pisos estão marcados de forma clara?\n(bom =3, adequado=2, pobre=1, nenhum =0. Parque com um único piso = 3)"]
[166,"Is there additional signing or prompts to orient the pedestrian on the parking deck\r(good =2, some =1, none = 0)",166,"Is there additional signing or prompts to orient the pedestrian on the parking deck\n(good =2, some =1, none = 0)","Is  er extra bebording of markering om voetgangers op de parkeervloer te geleiden?\n• goed =2, hier en daar =1, geen = 0","Y a-t-il une identification ou un marquage spécifique sur le sol pour aider les piétons à trouver leur chemin ?\n(Bon=2, Par-çi par-là=1, absent= 0)","Gibt es zusätzliche Schilder oder Anzeigen zur Verbesserung der Orientierung der Fußgänger?\n(gut = 2, einige = 1, keine = 0)","Existe señalización adicional para orientar al peatón\n(buena =2, alguna =1, ninguna = 0)","Existe sinalização adicional ou instruções para orientar os peões no piso de estacionamento\n(bom =2, alguns =1, nenhum = 0)"]
[167,"Are parking spaces individually numbered\r(Numbered including floor identification =2, Just numbers =1, none =0)",167,"Are parking spaces individually numbered\n(Numbered including floor identification =2, Just numbers =1, none =0)","Zijn parkeervakken voorzien van identificatie?\n• Nummering incl vloeraanduiding=2\n• Alleen nummering=1\n• Geen=0","Les aires de stationnement sont-elles numérotées individuellement \n(Numérotation reprenant une indication d’étage=2, Juste une numérotation=1, absent =0)","Sind die Stellplätze einzeln nummeriert?\n(nummeriert mit Geschoßbezeichnung = 2, nur nummeriert = 1, nicht = 0)","Als plazas están numeradas individualmente\n(Numeración incluye identificación de planta =2, Sólo números =1, ninguna =0)","Os lugares de estacionamento estão individualmente numerados\n(Numerados, incluindo identificação no chão =2, Apenas número =1, nada =0)"]
[168,"Use of colours for  way finding\r(Yes= 1, No= 0)",168,"Use of colours for  way finding\n(Yes= 1, No= 0)","Gebruik van kleuren voor oriëntatie \n• Ja= 1, Nee= 0","Utilisation de couleurs pour trouver son chemin\n(Oui= 1, Non= 0)","Verwendung von Farben zur Orientierung\n(ja = 1, nein = 0)","Uso de colores para orientación\n(Sí= 1, No= 0)","Utilização de cores para localização\n(Sim= 1, Não= 0)"]
[169,"Guidance sign posting for cars on roads to car park",169,"Guidance sign posting for cars on roads to car park","Bewegwijzering naar de garage voor auto’s op weg naar de garage","Signalisation en rue à l’attention des conducteurs pour trouver le chemin vers le parking","Parkleitsystem","Señalización de orientación hacia al aparcamiento en las proximidades del mismo","Há sinalização a indicar a entrada do parque de estacionamento nas estradas circundantes ao mesmo?"]
[170,"Static sign system only (Yes = 1, No = 0)",170,"Static sign system only (Yes = 1, No = 0)","Alleen statische borden\n• Ja = 1, Nee = 0","Uniquement signalisation statique (Oui= 1, Non = 0)","Statisch (ja = 1, nein = 0)","Únicamente señalización estática (Sí = 1, No = 0)","Somente sinais estáticos (Sim = 1, Não = 0)"]
[171,"Dynamic sign system additionally (Yes = 1, No = 0)",171,"Dynamic sign system additionally (Yes = 1, No = 0)","Dynamische aanduiding vol/vrij of plaatsen, extra:\n• Ja = 1, Nee = 0","Additionnellement signalisation dynamique (Oui= 1, Non = 0)","Dynamisch (ja = 1, nein = 0)","Señalización dinámica adicional (Sí = 1, No = 0)","Adicionalmente sinalização dinâmica (Sim = 1, Não = 0)"]
[172,"Illuminated signage at car park entrance",172,"Illuminated signage at car park entrance","Verlichte aanduiding bij de inrit:","Signalisation lumineuse à l’entrée du parking","Beleuchtete Anzeige an der Einfahrt","Señalización luminosa a la entrada del aparcamiento","Sinalização iluminada na entrada do parque de estacionamento"]
[173,"Signal green arrow, red cross for direction (Yes = 1, No = 0)",173,"Signal green arrow, red cross for direction (Yes = 1, No = 0)","Signaal kruis/pijl aanduiding rijrichting\n• Ja = 1, Nee = 0 ","Signalisation directionnelle fléchée (flèche verte, croix rouge) (Oui = 1, Non = 0)","Grüner Pfeil/rotes Kreuz-Anzeige (ja = 1, nein = 0)","Señalización direccional flecha verde, cruz roja (Sí = 1, No = 0)","Sinal direcional (seta verde, cruz vermelha) (Sim = 1, Não = 0)"]
[174,"Signal full/free (Yes = 1, No = 0)",174,"Signal full/free (Yes = 1, No = 0)","Signaal vol/vrij \n• Ja = 1, Nee = 0","Signalisation Libre/Complet (Oui = 1, Non = 0)","Frei/Besetzt-Anzeige (ja = 1, nein = 0)","Señal libre/completo (Sí = 1, No = 0)","Sinal completo/livre (Sim = 1, Não = 0)"]
[175,"Signage at pedestrian entrance (Yes = 1, No = 0)",175,"Signage at pedestrian entrance (Yes = 1, No = 0)","Aanduiding voetgangerstoegang\n• Ja = 1, Nee = 0","Signalisation vers les entrées piétons (Oui = 1, Non = 0)","Anzeige an den Fußgängerzugängen (ja = 1, nein = 0)","Señalización de accesos peatonales (Sí = 1, No = 0)","Sinalização na entrada pedonal (Sim = 1, Não = 0)"]
[176,"Comfort and Miscellaneous",176,"Comfort and Miscellaneous","Comfort en diversen","Confort et Divers","Komfort und verschiedenes","Comfort y varios","Conforto e Diversos"]
[177,"Notice-board at pedestrian entrance/exit showing:",177,"Notice-board at pedestrian entrance/exit showing:","Informatiebord bij voetgangerstoegang met:","Panneau d’affichage aux entrées/sorties piétons indiquant:","Hinweisschild an den Fußgängerzugängen bezüglich :","Panel en los accesos peatonales indicando:","Placas informativas nas entradas/saídas pedonais:"]
[178,"Access hours normal/special (yes = 1, no = 0)",178,"Access hours normal/special (yes = 1, no = 0)","Openingstijden normale en bijzondere dagen\n• Ja = 1, Nee = 0","Heures d’ouverture normales/spécifiques (oui = 1, non = 0)","Öffnungszeiten übliche/besondere (ja = 1, nein = 0)","Horas de apertura normales/específicas (sí = 1, no = 0)","Horário de funcionamento normal/especial (sim = 1, não = 0)"]
[179,"Readable & understandable tariff board (yes = 1, no = 0)",179,"Readable & understandable tariff board (yes = 1, no = 0)","Duidelijke tarieftabel\n• Ja = 1, Nee = 0","Affichage du tarif lisible et compréhensible (Oui = 1, non = 0)","Lesbare und verständliche Anzeige der Parktarife (ja = 1, nein = 0)","Cuadro de tariifas legible y fácil de entender (sí = 1, no = 0)","Tarifário legível e compreensível (sim = 1, não = 0)"]
[180,"Operators terms and conditions (yes = 1, no = 0)",180,"Operators terms and conditions (yes = 1, no = 0)","Algemene Voorwaarden Exploitant\n• Ja = 1, Nee = 0","Règlement intérieur et conditions  (Oui = 1, non = 0)","Einstellbedingungen (ja = 1, nein = 0)","Términos y condiciones (sí = 1, no = 0)","Termos e Condições do Operador (sim = 1, não = 0)"]
[{"$f":"C184","v":181},"Payment options (pay at exit/pay at pay station):",181,"Payment options (pay at exit/pay at pay station):","Betaalmogelijkheden (automaat en uitrit):","Moyens de paiement (paiement à la sortie/paiement à la caisse automatique):","Bezahlmöglichkeiten (Zahlung am Ein-/Ausgang/am Kassenautomat):","Opciones de pago (pago a la salida/pago manual):","Opções de pagamento (pagamento na saída/pagamento na caixa de pagamento):"]
[182,"Accepts coins? (yes =1, no =0)",182,"Accepts coins? (yes =1, no =0)","Cash munten:  Ja =1, nee =0","Monnaie? (oui =1, non =0)","Münzzahlung? (ja = 1, nein = 0)","Se aceptan monedas? (sí =1, no =0)","Aceita moedas? (sim =1, não =0)"]
[183,"Change given? (yes =1, no =0)",183,"Change given? (yes =1, no =0)","Wisselgeld teruggave: Ja =1, nee =0","Change rendu? (oui =1, non =0)","Wechselgeld? (ja = 1, nein = 0)","Da cambio? (sí =1, no =0)","Devolução de troco? (sim =1, não =0)"]
[184,"Accepts banknotes?  (yes =1, no =0)",184,"Accepts banknotes?  (yes =1, no =0)","Cash bankbiljetten:  Ja =1, nee =0","Billets de banque?  (oui=1, non =0)","Banknoten?  (ja = 1, nein = 0)","Se aceptan billetes?  (sí =1, no =0)","Aceita notas?  (sim =1, não =0)"]
[185,"Accepts bank cards?  (yes =1, no =0)",185,"Accepts bank cards?  (yes =1, no =0)","Bank/kredietkaarten:  Ja =1, nee =0","Cartes de crédit?  (oui =1, non =0)","Kreditkarten?  (ja = 1, nein = 0)","Se aceptan tarjetas de crédito?  (sí =1, no =0)","Aceita cartões bancários?  (sim =1, não =0)"]
[186,"Payment by smart phone? (yes =1, no =0)",186,"Payment by smart phone? (yes =1, no =0)","Betalen met mobiele telefoon: ja=1, nee=0","Par téléphone portable? (oui =1, non =0)","Zahlung per Mobiltelefon? (ja = 1, nein = 0)","Pago a través de smart phone? (sí =1, no =0)","Pagamento por telemóvel? (sim =1, não =0)"]
[187,"Payment by card/phone at exit? (yes =1, no =0)",187,"Payment by card/phone at exit? (yes =1, no =0)","Betalen met bankkaart of mobiele telefoon aan de uitrit: ja=1, nee=0","Par carte/gsm à la sortie? (oui =1, non =0)","Karten-/Handyzahlung am Ausgang? (ja = 1, nein = 0)","Pago a través de tarjeta/teléfono a la salida? (sí =1, no =0)","Pagamento por cartão/telefone na saída? (sim =1, não =0)"]
[188,"ID & payment by LPR? (yes =1, no =0)",188,"ID & payment by LPR? (yes =1, no =0)","Identificatie en betalen op basis van kenteken: ja=1, nee=0","Identification et paiement sur base plaque immatriculation? (oui =1, non =0)","Identifikation und Zahlung per Kennzeichenerkennung? (ja = 1, nein = 0)","Identificación y pago a través de la matrícula? (sí =1, no =0)","Identificação e pagamento por reconhecimento de matrícula? (sim =1, não =0)"]
[189,"Accepts other cards: How many? (1 point per additional option up to 3)",189,"Accepts other cards: How many? (1 point per additional option up to 3)","Andere betaalmogelijkheden:\n• 1 punt per extra mogelijkheid tot max 3","Acceptation d’autres cartes: Combien? (1 point par moyen supplémentaire jusqu’à 3 pts.)","Akzeptanz anderer Karten: Wie viele? (1 Punkt je zusätzlicher Option bis 3 Punkte)","Se aceptan otras tarjetas: cuántas? (1 punto adicional por cada una hasta 3)","Aceita outros cartões: Quantos? (1 ponto por opção adicional até 3)"]
[190,"Payment at staffed desk: (yes = 1, no = 0)",190,"Payment at staffed desk: (yes = 1, no = 0)","Betaling aan bemande kassa: \n• Ja = 1, Nee = 0","Au guichet du préposé: (oui = 1, non = 0)","Zahlung an besetzter Kasse: (ja = 1, nein = 0)","Pago en el centro de control: (sí = 1, no = 0)","Pagamento na receção com funcionário: (sim = 1, não = 0)"]
[191,"Is this a Pay and Display Car Park?",191,"Is this a Pay and Display Car Park?","Pay and Display/ticketautomaten?","Est-ce un parking sans barrières ( paiement à une borne) ?","Handelt es sich um ein Parkhaus ohne Schranken? (mit Parkscheinautomaten)?","Se trata de un aparcamiento sin barreras (pago en parquímetros)?","É um Parque de Estacionamento sem barreiras?"]
[192,"Number of Pay points for Barrier controlled car parks:\r(One pay station = 0,  More than one =1, One at each pedestrian entrance, excluding fire escapes =2, More than one at each pedestrian entrance =3)",192,"Number of Pay points for Barrier controlled car parks:\n(One pay station = 0,  More than one =1, One at each pedestrian entrance, excluding fire escapes =2, More than one at each pedestrian entrance =3)","Aantal betaalpunten bij garages met slagbomen\n• Eén = 0,  Meer dan één  =1\n• Eén bij iedere voetgangerstoegang =2\n• Meer dan gemiddeld één per voetgangerstoegang =3","Nombre de bornes de paiement pour un parking équipés de barrières:\n(Une borne de paiement = 0,  Plus que une =1, Une à chaque entrée piétons excepté les portes de secours=2, Une à chaque entrée piétons =3)","Anzahl der Bezahlstationen für beschrankte Parkhäuser:\n(eine = 0, mehr als eine = 1, eine an jedem Fußgängerzugang (außer Notausgänge) = 2, eine an jedem Fußgängerzugang = 3)","Número de puntos de pago en aparcamientos controlados mediante barreras:\n(Un punto de pago = 0,  Más de uno =1, Uno en cada acceso peatonal, excluyendo salidas de emergencia =2, Más de uno en cada acceso peatonal =3)","Número de pontos de Pagamento por Barreira controlada no parque de estacionamento:\n(Um ponto de pagamento = 0, Mais do que um = 1, um em cada entrada pedonal, excluindo escadas de incêndio = 2, mais do que um em cada entrada pedonal = 3)"]
[193,{"$f":"IF(ISBLANK(VLOOKUP(A196,$C$4:$V$9989,1+$A$1)),D196,VLOOKUP(A196,$C$4:$V$9989,1+$A$1))","v":"Number of Pay points for Pay and Display Car Parks\r(One =0, < 1 for every 50 spaces =2, >1 for every 50 spaces =3)"},193,"Number of Pay points for Pay and Display Car Parks\n(One =0, < 1 for every 50 spaces =2, >1 for every 50 spaces =3)","Pay and Display/ticketautomaten\n• Eén=0,\n• <1/50 plaatsen=2,\n• >1/50 plaatsen=3","Nombre de bornes de paiement pour un parking sans barrières\n(Une =0, < 1 par 50 emplacements =2, >1 par 50 emplacements=3)","Anzahl der Parkscheinautomaten für unbeschrankte Parkhäuser:\n(einer = 0, weniger als einer pro 50 Stellplätze = 1, mehr als einer pro 50 Stellplätze = 3)","Número de parquímetros en aparcamientos sin barreras\n(Uno =0, < 1 cada 50 plazas =2, >1 cada 50 plazas =3)","Número de pontos de Pagamento para parques de estacionamento sem barreiras\n(Um = 0, <1 para cada 50 lugares = 2,> 1 para cada 50 lugares = 3)"]
[194,"Customer toilets:",194,"Customer toilets:","Toilet in de garage","Toilettes publiques:","Öffentliche Toiletten:","Aseos públicos:","WC para clientes:"]
[195,"Exist? (yes= 2, no= 0)",195,"Exist? (yes= 2, no= 0)","• Ja= 2, nee= 0","Y en a-t-il? (oui= 2, non= 0)","Vorhanden? (ja = 2, nein = 0)","Existen? (sí= 2, no= 0)","Existem? (sim= 2, não= 0)"]
[196,"Disabled toilet? (yes=1, no= 0)",196,"Disabled toilet? (yes=1, no= 0)","Mindervaliden toilet:  \n• Ja=1, nee= 0","Toilettes spécifiques pour handicapés? (oui=1, non= 0)","Behindertentoilette? (ja = 1, nein = 0)","Aseo para minusválidos? (sí=1, no= 0)","WC para deficientes? (sim=1, não= 0)"]
[197,"unisex = 0, male/female separated = 1",197,"unisex = 0, male/female separated = 1","• Één toilet = 0, man/vrouw apart toilet = 1","Toilettes uniques= 0, Hommes/femmes séparés= 1","Toiletten unisex= 0, Frauen/Männer getrennt = 1","unisex = 0, separación hombres/mujeres = 1","unisexo = 0, masculino/feminino separados = 1"]
[198,"attendant: yes=1, no= 0",{"$f":"C200+1","v":198},"attendant: yes=1, no= 0","Toezicht: \n• Ja=1, nee= 0","Présence d’un préposé aux toilettes: oui=1, non= 0","Toilettenaufseher(-in): ja = 1, nein = 0","presencia de un empleado: Sí=1, no= 0","pessoal de apoio: sim=1, não= 0"]
[199,"Use of colours/ embellishing works",199,"Use of colours/ embellishing works","Gebruik van kleuren en afwerking","Usage de couleurs/ embellissements","Verwendung von Farben / Verschönerungen","Uso de colores/ornamentos","Uso de cores/ embelezamento da obra"]
[200,"Coloured pillars =1, no/concrete grey = 0",200,"Coloured pillars =1, no/concrete grey = 0","Geschilderde kolommen=1 , grijs beton=0","Piliers en couleurs =1, non/béton brut = 0","Farbige Stützen = 1, nein, betongrau = 0","Pilares pintados =1, no/hormigón gris = 0","Pilares coloridos =1, não/betão cinza = 0"]
[201,"Coloured walls =1, no/concrete grey = 0",201,"Coloured walls =1, no/concrete grey = 0","Geschilderde wanden=1 , grijs beton=0","Murs en couleurs =1, non/béton brut = 0","Farbige Wände = 1, nein, betongrau = 0","Muros pintados =1, no/hormigón gris = 0","Paredes coloridas =1, não/betão cinza = 0"]
[202,"Extra embellishment",202,"Extra embellishment","Extra verfraaiing:","Embellissement supplémentaire","Besondere verschönernde Elemente:","Ornamentos adicionales","Embelezamento extra"]
[203," Artwork: (Yes = 2, No = 0)",203," Artwork: (Yes = 2, No = 0)","Kunst: Ja = 2, Nee = 0","Oeuvre d’art: (Oui = 2, Non = 0)","Kunstwerke: (ja = 2, nein = 0)","Obras de arte: (Sí = 2, No = 0)","Obras de arte: (Sim = 2, Não = 0)"]
[204,"Planters: (Yes = 1, No = 0)",204,"Planters: (Yes = 1, No = 0)","Plantenbakken:  Ja = 1, Nee = 0","Plantes: (Oui = 1, Non = 0)","Pflanzen: (ja = 1, nein = 0)","Botánica: (Sí = 1, No = 0)","Plantas: (Sim = 1, Não = 0)"]
[205,"Other: (Yes = 1, No = 0)",205,"Other: (Yes = 1, No = 0)","Andere verfraaiing: Ja = 1, Nee = 0","Autres: (Oui = 1, Non = 0)","Sonstiges: (ja = 1, nein = 0)","Otros: (Sí = 1, No = 0)","Outros: (Sim = 1, Não = 0)"]
[206,"Mobile phone coverage (Yes = 2, No = 0)",206,"Mobile phone coverage (Yes = 2, No = 0)","Dekking mobiele telefoon in de garage\n• Ja = 2, Nee = 0","Couverture telephones portables (Oui = 2, Non = 0)","Handyempfang (ja = 2, nein = 0)","Cobertura para telefonía móvil (Sí = 2, No = 0)","Cobertura da rede móvel (Sim = 2, Não = 0)"]
[207,"Continuity of radio signals (Yes = 1, No = 0)",207,"Continuity of radio signals (Yes = 1, No = 0)","Dekking radio signaal in de garage\n• Ja = 1, Nee = 0","Couverture signal radio (Oui = 1, Non = 0","Radioemfang (ja = 1, nein = 0)","Cobertura señal de radio (Sí = 1, No = 0)","Continuidade do sinal de rádio (Sim = 1, Não = 0)"]
[208,"Music",208,"Music","Muziek","Musique","Musik","Música","Música"]
[209,"Background music: yes = 2, No = 0",209,"Background music: yes = 2, No = 0","Achtergrondmuziek:  \n• ja = 2, Nee = 0","Musique en arrière-fond: Oui = 2, Non = 0","Hintergrundmusik:  ja = 2, nein = 0","Música de fondo: Sí = 2, No = 0","Música de fundo: sim = 2, Não = 0"]
[210,"Differentiation for way finding :  yes =1, No = 0",210,"Differentiation for way finding :  yes =1, No = 0","Ondersteuning voor orientatie :  \n• Ja =1, Nee = 0","Action pour faciliter l’orientation dans parking : Oui =1, Non = 0","Maßnahmen zur Erleichterung der Orientierung im Parkhaus:  ja = 1, nein = 0","Diferenciación para orientación en el interior:  Sí =1, No = 0","Música diferenciada para facilitar a orientação no parque de estacionamento :  sim =1, Não = 0"]
[211,"Energy and Environment",211,"Energy and Environment","Energie & Milieu","Energie et Environnement","Energie und Umwelt","Energía y medioambiente","Energia e Ambiente"]
[212,"Energy Saving Lighting Systems",212,"Energy Saving Lighting Systems","Energie besparende maatregelen mbt verlichting","Système d’économie d’éclairage","Energiesparende Beleuchtung","Sistemas de eficiencia energética en iluminación","Sistemas de iluminação de poupança de energia"]
[213,"Power Factor Compensation (Yes=1, No=0)",213,"Power Factor Compensation (Yes=1, No=0)","Ja, opstart  ter reductie van piekbelasting= 1","Système pour gérer les pics de consommation (Oui=1, Non=0)","Elektronische Vorschaltgeräte (EVG) (ja = 1, nein = 0)","Compensación del factor de potencia (Sí=1, No=0)","Compensação do fator de potência (Sim=1, Não=0)"]
[214,"Other Systems (Yes=1, No=0)",214,"Other Systems (Yes=1, No=0)","Ja andere systemen= 1","Autres systèmes (Oui=1, Non=0)","Andere Systeme (ja = 1, nein = 0)","Otros sistemas (Sí=1, No=0)","Outros Sistemas (Sim=1, Não=0)"]
[215,"Movement detection variable lights, remaining quality (yes= 2, no= 0)",215,"Movement detection variable lights, remaining quality (yes= 2, no= 0)","Licht schakeling op bewegingsdetectie\n• Ja=2, Nee=0","Détection de mouvement, variation de la luminosité  (oui= 2, non= 0)","Bewegungsgesteuerte Beleuchtung (ja = 2, nein = 0)","Iluminación variable mediante sensores de movimiento (sí= 2, no= 0)","Iluminação variável com deteção de movimento, mantendo-se a qualidade (sim= 2, não= 0)"]
[216,"Adaptable lighting for daylight compensation at entrance area \r(yes= 2, no= 0)",216,"Adaptable lighting for daylight compensation at entrance area \n(yes= 2, no= 0)","Verlichting aanpassend aan externe omstandigheden (daglichtcompensatie) aan de inrit:\n• Ja= 2, Nee=0\nIrrelevant (ondergronds) =2","Luminosité variable en fonction de la lumière du jour à l’entrée du parking. \n(oui= 2, non= 0)\n","Adaptionsstrecke an der Einfahrt.\n(ja = 2, nein = 0)","Iluminación variable a la entrada del aparcamaniento en función de la luz natural exterior\n(sí= 2, no= 0)","Iluminação adaptável para compensação da luz do dia na área da entrada \n(sim= 2, não= 0)"]
[217,"Adaptable lighting for ambient light conditions at parking floor from daylight\r(yes= 2, no= 0, Irrelevant (below ground) =2)",217,"Adaptable lighting for ambient light conditions at parking floor from daylight\n(yes= 2, no= 0, Irrelevant (below ground) =2)","Verlichting aanpassend aan externe omstandigheden (daglichtcompensatie) op de parkeervloer:\n• Ja= 2, Nee=0\n• Irrelevant (ondergronds) =2","Luminosité variable dans les étages en fonction de la luminosité extérieure \n(oui= 2, non= 0, Pas d’application (parking sous-terrain) =2)\n","An das Tageslicht anpassbare Beleuchtung der Parkebenen (z.B. Dämmerungsschalter)\n(ja = 2, nein = 0, unzutreffend (Tiefgarage) = 2)","Iluminación variable en las plantas del aparcamiento en función de la luz natural exterior\n(sí= 2, no= 0, No aplica (subterráneo) =2)","Iluminação adaptável para condições de luz ambiente no piso de estacionamento com luz do dia\n(sim= 2, não= 0, Irrelevante (abaixo do solo) =2)"]
[218,"Solar panels on the roof or other green energy initiatives (yes= 2, no= 0)",218,"Solar panels on the roof or other green energy initiatives (yes= 2, no= 0)","Zonnepanelen op het dak of andere groene energie:\n• Ja= 2, Nee=0","Panneaux solaires sur le toit ou autre initiative d’énergie verte (oui= 2, non= 0)","Photovoltaik oder andere umweltfreundliche energetische Initiativen (ja = 2, nein = 0)","Paneles solares en cubierta u otras iniciativas en materia de energías renovables (sí= 2, no= 0)","Painéis solares na cobertura ou outras iniciativas de energia verde (sim= 2, não= 0)"]
[219,"Special treatment of cleaning water:\r•  yes= 2, no= 0",219,"Special treatment of cleaning water:\n•  yes= 2, no= 0","Gescheiden afvoer afvalwater (bv olie- of slibvangers) \n• Ja=2, Nee=0","Traitement eaux usées ( séparation hydrocarbures/ eaux sales):\n•  oui= 2, non= 0","Spezielle Behandlung von Schmutzwasser:\n•  ja = 2, nein = 0","Tratamiento de aguas fecales:\n•  sí= 2, no= 0","Tratamento especial de água residuais:\n•  sim= 2, não= 0"]
[220,"Grey water or re-use of rain water\r•  yes= 2, no= 0\r",220,"Grey water or re-use of rain water\n•  yes= 2, no= 0\n","Scheiding drink- en spoelwater cq hergebruik van regenwater:\n• Ja=2, Nee=0","Séparation eaux potables/eaux de nettoyage, récupération eaux de pluie \n•  oui= 2, non= 0","Verwendung von Regenwasser als Brauchwasser (z.B. zur Reinigung oder Toilettenspülung)\n•  ja = 2, nein = 0","Tratamiento de aguas de limpieza y reutilización de aguas pluviales\n•  sí= 2, no= 0\n","Separação de água potável / água de limpeza, recuperação de águas pluviais\n•  sim= 2, não= 0"]
[221,"Electric Vehicles recharging points: (Yes, more than one= 2, One recharging point=1, None=0)",221,"Electric Vehicles recharging points: (Yes, more than one= 2, One recharging point=1, None=0)","Laadpunten voor elektrische auto’s\n• Ja, meer dan één=2, Eén = 1, Nee=0","Bornes de rechargement pour véhicules électriques: (Oui, plusieurs bornes= 2, Une borne de rechargement=1, Absent=0)","Ladestationen für Elektrofahrzeuge: (ja, mehrere = 2, eine = 1, keine = 0)","Puntos de recarga para vehículo eléctrico: (Sí, más de uno= 2, Un punto de recarga=1, Ninguno=0)","Pontos para recarga de Veículos Elétricos: (Sim, mais que um= 2, Um ponto de reacrga=1, Nenhum=0)"]
[222,"Car sharing and similar initiatives\r•  yes= 2, no= 0",222,"Car sharing and similar initiatives\n•  yes= 2, no= 0","Deelauto’s etc\n• Ja, meer dan één =2, Eén = 1, Nee=0","Voitures partagées ou autres initiatives semblables\n•  oui= 2, non= 0","Car Sharing oder ähnliche Angebote\n•  ja = 2, nein = 0","Vehículo compartido e iniciativas similares\n•  sí= 2, no= 0","Sistema de Partilha de Veículos ou iniciativas semelhantes\n•  sim= 2, não= 0"]
[223,"Other environmental or zero emission  initiatives\r•  yes= 2, no= 0",223,"Other environmental or zero emission  initiatives\n•  yes= 2, no= 0","Overige milieu initiatieven:\n• Ja=2, Nee=0","Autres initiatives environnementales ou d’émissions 0 CO\n•  oui= 2, non= 0","Andere umweltfreundliche Initiativen, z.B. zur CO²-Reduzierung\n•  ja = 2, nein = 0","Otras iniciativas medioambientales o de \"emición cero\"\n•  sí= 2, no= 0","Outras iniciativas ambientais ou zero emissão\n•  sim= 2, não= 0"]
[224,"Minus Points",224,"Minus Points","Malus Punten","Points malus","Minuspunkte","Puntos negativos","Penalizações"]
[225,"Presence of Graffiti",225,"Presence of Graffiti","Zichtbare aanwezigheid van graffiti","Présence de Graffitis","Vorhandensein von Graffiti in den:","Presencia graffiti y pintadas","Presença de Graffitis"]
[226,"Stairwells (Yes= -2, No= 0)",226,"Stairwells (Yes= -2, No= 0)","Trappenhuizen\n• Ja= -2, Nee= 0","Cages d’escaliers (Oui= -2, Non= 0)","Treppenhäusern (ja = -2, nein = 0)","Escaleras (Sí= -2, No= 0)","Caixa de Escadas (Sim= -2, Não= 0)"]
[227,"Elevator (Yes= -2, No= 0)",227,"Elevator (Yes= -2, No= 0)","Lift\n• Ja= -2, Nee= 0","Ascenseurs (Oui= -2, Non= 0)","Aufzügen (ja = -2, nein = 0)","Ascensores (Sí= -2, No= 0)","Elevador (Sim= -2, Não= 0)"]
[228,"Toilets (Yes= -2, No= 0)",228,"Toilets (Yes= -2, No= 0)","Toiletten\n• Ja= -2, Nee= 0","Toilettes (Oui= -2, No= 0)","Toiletten (ja = -2, nein = 0)","Aseos (Sí= -2, No= 0)","WC (Sim= -2, Não= 0)"]
[229,"Parking area (Yes= -2, No= 0)",229,"Parking area (Yes= -2, No= 0)","Parkeervloer\n• Ja= -2, Nee= 0","Parking (Oui= -2, Non= 0)","Parkebenen (ja = -2, nein = 0)","Zonas de aparcamiento (Sí= -2, No= 0)","Área de estacionamento (Sim= -2, Não= 0)"]
[230,"Outside walls (Yes= -2, No= 0)",230,"Outside walls (Yes= -2, No= 0)","Buitenmuur\n• Ja= -2, Nee= 0","Murs extérieurs (Oui= -2, Non= 0)","Außenwände (ja = -2, nein = 0)","Muros exteriores (Sí= -2, No= 0)","Paredes exteriores (Sim= -2, Não= 0)"]
[231,"Presence of dirt",231,"Presence of dirt","Zichtbaar vuil en zwerfvuil","Présence de déchets","Vorhandensein von Schmutz in den","Presencia de suciedad","Presença de sujidade"]
[232,"Stairwells (Yes= -2, No= 0)",232,"Stairwells (Yes= -2, No= 0)","Trappenhuizen\n• Ja= -2, Nee= 0","Cages d’escaliers (Oui= -2, Non= 0)","Treppenhäusern (ja = -2, nein = 0)","Escaleras (Sí= -2, No= 0)","Caixa de Escadas (Sim= -2, Não= 0)"]
[233,"Elevator (Yes= -2, No= 0)",233,"Elevator (Yes= -2, No= 0)","Lift\n• Ja= -2, Nee= 0","Ascenseurs (Oui= -2, Non= 0)","Aufzügen (ja = -2, nein = 0)","Ascensores (Sí= -2, No= 0)","Elevador (Sim= -2, Não= 0)"]
[234,"Toilets (Yes= -2, No= 0)",234,"Toilets (Yes= -2, No= 0)","Toiletten\n• Ja= -2, Nee= 0","Toilettes (Oui= -2, Non= 0)","Toiletten (ja = -2, nein = 0)","Aseos (Sí= -2, No= 0)","WC (Sim= -2, Não= 0)"]
[235,"Parking area (Yes= -2, No= 0)",235,"Parking area (Yes= -2, No= 0)","Parkeervloer\n• Ja= -2, Nee= 0","Parking  (Oui= -2, Non= 0)","Parkebenen (ja = -2, nein = 0)","Zonas de aparcamiento (Sí= -2, No= 0)","Área de estacionamento (Sim= -2, Não= 0)"]
[236,"Outside of entrance for pedestrians + cars (Yes= -2, No= 0)",236,"Outside of entrance for pedestrians + cars (Yes= -2, No= 0)","Buitenzijde inrit en voetgangersentree\n• Ja= -2, Nee= 0","A l’extérieur des entrées piétons et voitures (Oui= -2, Non= 0)","Vor den Eingängen und Einfahrten (ja = -2, nein = 0)","En el exterior de los accesos peatonales y de vehículos (Sí= -2, No= 0)","Fora das entradas pedonais + carros (Sim= -2, Não= 0)"]
[237,"Poor quality of paint work",237,"Poor quality of paint work","Slechte staat van schilderwerk","Faible qualité de la peinture","Schlechte Qualität von Anstrichen in den","Baja calidad de la pintura","Má qualidade do trabalho de pintura"]
[238,"Stairwells (Yes= -2, No= 0)",238,"Stairwells (Yes= -2, No= 0)","Trappenhuizen\n• Ja= -2, Nee= 0","Cages d’escaliers (Oui= 2, Non= 0)","Treppenhäusern (ja = -2, nein = 0)","Escaleras (Sí= -2, No= 0)","Caixa de escadas (Sim= -2, Não= 0)"]
[239,"Elevator (Yes= -2, No= 0)",239,"Elevator (Yes= -2, No= 0)","Lift\n• Ja= -2, Nee= 0","Ascenseurs (Oui= -2, Non= 0)","Aufzügen (ja = -2, nein = 0)","Ascensores (Sí= -2, No= 0)","Elevador (Sim= -2, Não= 0)"]
[240,"Parking area (Yes= -2, No= 0)",240,"Parking area (Yes= -2, No= 0)","Parkeervloer\n• Ja= -2, Nee= 0","Parking  (Oui= -2, Non= 0)","Parkebenen (ja = -2, nein = 0)","Zonas de aparcamiento (Sí= -2, No= 0)","Área de estacionamento (Sim= -2, Não= 0)"]
[241,"Poor quality horizontal markings (Yes= -2, No= 0)",241,"Poor quality horizontal markings (Yes= -2, No= 0)","Slechte kwaliteit van markeringen \n• Ja= -2, Nee= 0","Faible qualité des marquages au sol (Oui= 2, Non= 0)","Schlechte Qualität der Bodenmarkierungen (ja = 2, nein = 0)","Baja calidad de marcas horizontales (Sí= -2, No= 0)","Sinalização horizontal de má qualidade (Sim= -2, Não= 0)"]
[242,"Poor quality/lack of maintenance (pot holes ,damages) ",242,"Poor quality/lack of maintenance (pot holes ,damages) ","Slechte kwaliteit/achterstalling onderhoud, (gaten cq beschadigingen) ","Faible qualité/manquements au niveau de la maintenance (nids de poule ,dégâts divers,..)","Mangelhafte Instandhaltung (Schlaglöcher, bauliche Mängel, etc.) ","Baja calidad/falta de mantenimiento (baches ,daños) ","Má qualidade/falta de manutenção (buracos, danos)"]
[243,"Floors (Yes= -2, No= 0)",243,"Floors (Yes= -2, No= 0)","Parkeervloer\n• Ja= -2, Nee= 0","Sol (Oui= -2, Non= 0)","Boden (ja = -2, nein = 0)","Pavimentos (Sí= -2, No= 0)","Pisos (Sim= -2, Não= 0)"]
[244,"Walls (Yes= -2, No= 0)",244,"Walls (Yes= -2, No= 0)","Wanden\nJa= -2, Nee= 0","Murs (Oui= -2, Non= 0)","Wänden (ja = -2, nein = 0)","Muros (Sí= -2, No= 0)","Paredes (Sim= -2, Não= 0)"]
[{"$f":"C248","v":245},"Evidence of standing water (Yes= -2, No= 0)",245,"Evidence of standing water (Yes= -2, No= 0)","Lekkages en/of plasvorming\n• Ja= -2, Nee= 0","Traces évidentes d’eau stagnante(Oui= -2, Non= 0)","Vorhandensein von Pfützen (ja = -2, nein = 0)","Evidencia de agua estancada (Sí= -2, No= 0)","Evidência de água parada (Sim= -2, Não= 0)"]
[246,"Evidence of bad smells",246,"Evidence of bad smells","Stankoverlast","Odeurs désagréables","Vorhandensein von üblen Gerüchen in den","Evidencia de malos olores","Evidência de maus cheiros"]
[247,"Elevators (Yes= -2, No= 0)",247,"Elevators (Yes= -2, No= 0)","Lift\n• Ja= -2, Nee= 0","Ascenseurs (Oui= -2, Non= 0)","Aufzügen (ja = -2, nein = 0)","Ascensores (Sí= -2, No= 0)","Elevadores (Sim= -2, Não= 0)"]
[248,"Stairwells (Yes= -2, No= 0)",248,"Stairwells (Yes= -2, No= 0)","Trappenhuizen\n• Ja= -2, Nee= 0","Cages d’escaliers (Oui= -2, Non= 0)","Treppenhäusern (ja = -2, nein = 0)","Escaleras (Sí= -2, No= 0)","Caixa de escadas (Sim= -2, Não= 0)"]
[249,"Parking deck (Yes= -2, No= 0)",249,"Parking deck (Yes= -2, No= 0)","Parkeervloer\n• Ja= -2, Nee= 0","Sol du parking (Oui= -2, Non= 0)","Parkebenen (ja = -2, nein = 0)","Plazas de aparcamiento (Sí= -2, No= 0)","Plataforma de estacionamento (Sim= -2, Não= 0)"]
[250,"Over 15% of parking spaces in cul-de-sac without occupancy indication. (Yes= -5, No=0)",250,"Over 15% of parking spaces in cul-de-sac without occupancy indication. (Yes= -5, No=0)","Meer dan 15% van de plaatsen in doodlopende stukken zonder volindicatie\n• Ja= -5, Nee= 0","Plus de 15% des emplacements en cul-de sac sans indication d’occupation. (Oui= 5, Non=0)","Über 15% der Stellplätze in Sackgassen ohne Anzeige der Belegung (ja = 5, nein = 0)","Más del 15% de las plazas en viales sin salida, sin indicación sobre su ocupación (Sí= -5, No=0)","Mais de 15% dos lugares de estacionamento em becos sem saída sem indicação de ocupação. (Sim= -5, Não=0)"]
[{"$f":"C254","v":251},"Various points of criticism (to explain!)\r[E.g. hollow sound, squeaking tyres, unintended visitors, etc.] up to -10",251,"Various points of criticism (to explain!)\n[E.g. hollow sound, squeaking tyres, unintended visitors, etc.] up to -10","Overige punten van kritiek (uit te leggen!)\n(Bv piepende banden, geluidsoverlast, ongewenste gasten, etc) tot -10 punten","Autres points de critiques (à expliquer!)\n[Par ex. Bruit assourdissant, bruit de pneus sur le sol (epoxy), présence d’individus non désirés, etc.] jusqu’à -10","Verschiedene Kritikpunkte (zu erläutern!)\n[z.B.: Lärm, quietschende Reifen, unerwünschtes Publikum, etc.] bis zu-10 Pkt.","Puntos diversos de crítica (a desarrollar!)\n[Por ejemplo, eco, chirrido de neumáticos, visitantes inesperados, etc.] hasta -10","Vários pontos de crítica (para explicar!)\n[Por exemplo som oco, pneus a ranger, visitantes indesejados, etc.] até -10"]
[252,"Penalty for Mandatory Condition 1.4 Applies",252,"Penalty for Mandatory Condition 1.4 Applies","Penalty voor verplichte minimum eis 1.4 is van toepassing ",null,"Strafabzug für Mindestanforderung 1.4 kommt zur Anwendung.","Penalización por Condición Obligatoria 1.4","Penalização para Condição Obrigatória 1.4"]
[253,"Bonus Points",253,"Bonus Points","Bonus punten","Points bonus","Bonuspunkte","Puntos Bonus","Bonificações"]
[254,"Extra provisions in car park",254,"Extra provisions in car park","Extra voorzieningen in de garage","Dispositions supplémentaires dans le parking","Zusätzliche Einrichtungen im Parkhaus:","Elementos adicionales en el aparcamiento","Extras no parque de estacionamento"]
[255,"Special motorcycle area (Yes= 1, No= 0)",255,"Special motorcycle area (Yes= 1, No= 0)","Plaatsen voor motorfietsen\n• Ja= 1, Nee= 0","Espace spécifique pour motos (Oui= 1, Non= 0)","Motorradstellplätze (ja = 1, nein = 0)","Aparcamiento para motocicletas (Sí= 1, No= 0)","Área especial para motociclos (Sim= 1, Não= 0)"]
[256,"Lockers for customers’ use (Yes= 1, No= 0)",256,"Lockers for customers’ use (Yes= 1, No= 0)","Kluisjes voor klantgebruik\n• Ja= 1, Nee= 0","Consignes sécurisées pour clients (Oui= 1, Non= 0)","Schließfächer (ja = 1, nein = 0)","Taquillas para uso de los clientes (Sí= 1, No= 0)","Cacifos para uso dos clientes (Sim= 1, Não= 0)"]
[257,{"$f":"IF(ISBLANK(VLOOKUP(A260,$C$4:$V$9989,1+$A$1)),D260,VLOOKUP(A260,$C$4:$V$9989,1+$A$1))","v":"Other aids (Yes= 1, No= 0)"},257,"Other aids (Yes= 1, No= 0)","Andere voorzieningen\n• Ja= 1, Nee= 0","Autres aides(Oui= 1, Non= 0)","Andere Angebote (ja = 1, nein = 0)","Otras ayudas (Sí= 1, No= 0)","Outras ajudas (Sim= 1, Não= 0)"]
[258,"Bicycle rent (Yes= 1, No= 0)",258,"Bicycle rent (Yes= 1, No= 0)","Fietsverhuur\n• Ja= 1, Nee= 0","Location de vélos (Oui= 1, Non= 0)","Fahrradverleih (ja = 1, nein = 0)","Alquiler de bicicletas (Sí= 1, No= 0)","Aluguer de bicicletas (Sim= 1, Não= 0)"]
[259,"Other Driver Assistance (Yes= 1, No= 0)",259,"Other Driver Assistance (Yes= 1, No= 0)","Overige services voor automobilisten\n• Ja= 1, Nee= 0","Autres assistances aux conducteurs (Oui= 1, Non= 0)","Andere Fahrerservices (ja = 1, nein = 0)","Otro tipo de asistencia al conductor (Sí= 1, No= 0)","Outros formas de assistência ao condutor (Sim= 1, Não= 0)"]
[260,"Vending Machines (Yes= 1, No= 0)",260,"Vending Machines (Yes= 1, No= 0)","Verkoopautomaat\n• Ja= 1, Nee= 0","Distributeurs boissons, friandises (Oui= 1, Non= 0)","Verkaufsautomaten (ja = 1, nein = 0)","Máquinas de vending (Sí= 1, No= 0)","Máquinas de Vending (Sim= 1, Não= 0)"]
[261,"Heart Defibrillator (Yes= 1, No= 0)",261,"Heart Defibrillator (Yes= 1, No= 0)","Hart defibrillator\n• Ja= 1, Nee= 0","Défibrilateur (Oui= 1, Non= 0)","Defibrillator (ja = 1, nein = 0)","Desfibrilador (Sí= 1, No= 0)","Desfibrilador (Sim= 1, Não= 0)"]
[262,"First aid trained staff (Yes= 1, No= 0)",262,"First aid trained staff (Yes= 1, No= 0)","EHBO getraind personeel\n• Ja= 1, Nee= 0","Personnel formé aux premiers secours (Oui= 1, Non= 0)","Personal mit Erste-Hilfe-Ausbildung (ja = 1, nein = 0)","Personal preparado para prestar primeros auxilios (Sí= 1, No= 0)","Equipa treinada de primeiros socorros (Sim= 1, Não= 0)"]
[263,"Real time traffic data (Yes= 1, No= 0)",{"$f":"C265+1","v":263},"Real time traffic data (Yes= 1, No= 0)","Actuele verkeersgegevens\n• Ja= 1, Nee= 0","Données traffic en temps réel (Yes= 1, Non= 0)","Echtzeit-Verkehrsinformationen (ja = 1, nein = 0)","Datos de tráfico en tiempo real (Sí= 1, No= 0)","Dados de tráfego em tempo real (Sim= 1, Não= 0)"]
[264,"Other real time accessible information (e.g. local events) (Yes= 1, No= 0)",264,"Other real time accessible information (e.g. local events) (Yes= 1, No= 0)","Overige actuele informatie, bv evenementen\n• Ja= 1, Nee= 0","Autres informations actualisées  (par ex. Évènements locaux) (Oui= 1, Non= 0)","Andere aktuelle Informationen  (z.B. lokale Veranstaltungen) (ja = 1, nein = 0)","Otro tipo de información en tiempo real (por ejemplo ferias locales) (Sí= 1, No= 0)","Outras informações em tempo real acessível (por exemplo, eventos locais) (Sim= 1, Não= 0)"]
[265,"Measures to avoid traffic queues at peak hours (i.e. tidal lane at car entry/exit) - (Yes= 3, No= 0)",265,"Measures to avoid traffic queues at peak hours (i.e. tidal lane at car entry/exit) - (Yes= 3, No= 0)","Maatregelen om opstopping bij pieken te voorkomen, bv wisselstrook aan de in/uitrit\n• Ja= 3, Nee= 0","Mesures pour fluidifier le traffic en heure de pointe (par ex. usage d’une voie bidirectionnelle alternative en entrée/sortie) - (Oui= 3, Non= 0)","Maßnahmen zur Verbesserung des Verkehrsablaufes in Spitzenstunden (z.B. tageszeitlich wechselnde Ein-/Ausfahrtsspuren) - (ja = 3, nein = 0)","Medidas para evitar colas en horas punta (por ejemplo, carriles reversibles en acceso/salida) - (Sí= 3, No= 0)","Medidas para evitar filas de trânsito nas horas de ponta (por exemplo. utilização de um canal alternativo bidirecional de entrada/saída) - (Sim= 3, Não= 0)"]
[266,"Turn around possibility for cars before height barrier or full sign to prevent reversing (Yes= 3, No= 0)",266,"Turn around possibility for cars before height barrier or full sign to prevent reversing (Yes= 3, No= 0)","Keermogelijkheid voor hoogtebalk of volsignaal om achteruitrijden te voorkomen\n• Ja= 3, Nee= 0","Possibilité de faire demi-tour avant la barrière d’hauteur ou l’indication “complet” sans devoir faire marche arrière (Oui= 3, Non= 0)","Wendemöglichkeit für Fahrzeuge vor der Höhenbegrenzung oder besondere Anzeigen zur Vermeidung von Rückwärtsfahrten  (ja = 3, nein = 0)","Posibilidad de escapatoria antes de la barrera o bien indicación de \"completo\" sin necesidad de dar marcha atrás (Sí= 3, No= 0)","Possibilidade de escapatória antes da barreira de altura ou sinal completo para evitar inversões (Sim= 3, Não= 0)"]
[267,"Customer service desk (Yes= 1, No= 0)",267,"Customer service desk (Yes= 1, No= 0)","Klantenservice balie\n• Ja= 1, Nee= 0","Guichet service clientèle (Oui= 1, Non= 0)","Parkhausaufsicht mit Bedientresen (ja = 1, nein = 0)","Mostrador de atención al cliente (Sí= 1, No= 0)","Balcão de atendimento ao cliente (Sim= 1, Não= 0)"]
[268,"Escalators and/or travellators\r(To/from all levels =5, To/from some levels =3, No Escalators or Travellators = 0)",268,"Escalators and/or travellators\n(To/from all levels =5, To/from some levels =3, No Escalators or Travellators = 0)","Roltrappen of rolpaden (geschikt voor winkelwagens)\n• Naar/van alle parkeerlagen=5\n• Naar/van sommige parkeerlagen=3\n• Geen=0","Escalators  et/ou tapis roulants \n(Depuis/jusqu’à tous les étages =5, De/jusqu’à certains étages =3, Pas d’ escalators ou Tapis roulants = 0)","Rolltreppen oder Rollsteige\n(von/zu allen Etagen = 5, nur zu bestimmten Etagen = 3, keine Rolltreppen oder Rollsteige = 0)","Escaleras mecánicas o cintas\n(Desde/hasta todas las plantas =5, Desde/hasta algunas plantas =3, Sin escaleras mecánicas ni cintas = 0)","Escadas rolantes e/ou passadeiras rolantes\n(De/para todos níveis =5, De/para alguns níveis =3, Não existem escadas rolantes ou passadeiras rolantes = 0)"]
[269,"Localisation of parked cars by ticket or license plate\r(Yes= 1, No= 0)",269,"Localisation of parked cars by ticket or license plate\n(Yes= 1, No= 0)","Terugvinden van auto op basis van kaartje of kenteken:\n• Ja= 1, Nee= 0","Localisation du véhicule garé via numéro ticket ou plaque d’immatriculation \n(Oui= 1, Non= 0)","Lokalisierung von Fahrzeugen durch den Parkschein oder das Fahrzeugkennzeichen\n(ja = 1, nein = 0)","Localización de vehículos aparcados mediante el ticket o matrícula\n(Sí= 1, No= 0)","Localização de carros estacionados por bilhete ou matrícula\n(Sim= 1, Não= 0)"]
[270,"Other positive points e.g. extra services, friendly staff, tiled walls/floors, good fit of the car park in cityscape etc up to ten additional bonus points. To be explicitly identified.",270,"Other positive points e.g. extra services, friendly staff, tiled walls/floors, good fit of the car park in cityscape etc up to ten additional bonus points. To be explicitly identified.","Overige positieve punten (uit te leggen!)\n(bijv extra service, vriendelijk personeel, inpassing van de garage in de omgeving) tot 10 punten","Autres points positifs par ex. services extras, personnel particulièrement accueillant,bonne intégration du parking dans le tissu urbain, etc..jusqu’à 10 points supplémentaires (à expliquer !)","Andere positive Punkte oder Zusatzleistungen, wie freundliches Personal, gekachelte Wände/Böden, gutes Einfügen des Parkhauses in das Stadtbild usw. (zu beschreiben). (bis zu 10 Punkte).","Otros aspectos positivos, por ejemplo servicios adicionales, personal amable, muros/pavimentos alicatados, buen encaje urbanístico del aparcamiento en la ciudad, etc. hasta 10 puntos bonus adicionales. Deben ser identificados de manera explícita.","Outros pontos positivos, por exemplo, serviços extras, funcionários simpáticos, paredes/piso de azulejo, bom ajuste do parque de estacionamento na paisagem urbana etc até dez pontos de bônus adicionais. Para ser explicitamente identificado."]

{"sheet":"Options","index":17,"n_rows":597,"n_cols":9,"rows_kept":597,"cut":false,"hidden":true,"merged":[]}
[{"$f":"'Languages Available'!B1","v":1},"Language Selected:",null,{"$f":"'General Info'!E3","v":"English"}]
[null,null,null,1,2,3,4,5,6]
[null,"Active Language",null,{"$f":"VLOOKUP(D2,'Languages Available'!$A$3:$B$23,2)","v":"English"},{"$f":"VLOOKUP(E2,'Languages Available'!$A$3:$B$23,2)","v":"Dutch"},{"$f":"VLOOKUP(F2,'Languages Available'!$A$3:$B$23,2)","v":"Français"},{"$f":"VLOOKUP(G2,'Languages Available'!$A$3:$B$23,2)","v":"Deutsch"},{"$f":"VLOOKUP(H2,'Languages Available'!$A$3:$B$23,2)","v":"Spanish"},{"$f":"VLOOKUP(I2,'Languages Available'!$A$3:$B$23,2)","v":"Portuguese"}]
[{"$f":"C4","v":1},{"$f":"IF(ISBLANK(VLOOKUP(A4,$C$4:$V$10001,1+$A$1)),D4,VLOOKUP(A4,$C$4:$V$10001,1+$A$1))","v":"Morning"},1,"Morning","'s morgens","Matin","Morgen","Mañana","Manhã"]
[{"$f":"C5","v":2},{"$f":"IF(ISBLANK(VLOOKUP(A5,$C$4:$V$10001,1+$A$1)),D5,VLOOKUP(A5,$C$4:$V$10001,1+$A$1))","v":"Afternoon"},{"$f":"+C4+1","v":2},"Afternoon","'s middags","Après-midi","Nachmittag","Tarde","Tarde"]
[3,{"$f":"IF(ISBLANK(VLOOKUP(A6,$C$4:$V$10001,1+$A$1)),D6,VLOOKUP(A6,$C$4:$V$10001,1+$A$1))","v":"Evening"},{"$f":"+C5+1","v":3},"Evening","'s avonds","Soir","Abend","Noche","Noite"]
[4,null,4]
[5,{"$f":"IF(ISBLANK(VLOOKUP(A8,$C$4:$V$10001,1+$A$1)),D8,VLOOKUP(A8,$C$4:$V$10001,1+$A$1))","v":"Sunny"},5,"Sunny","zonnig","Ensoleillé","sonnig","Soleado","Sol"]
[6,{"$f":"IF(ISBLANK(VLOOKUP(A9,$C$4:$V$10001,1+$A$1)),D9,VLOOKUP(A9,$C$4:$V$10001,1+$A$1))","v":"Cloudy"},6,"Cloudy","bewolkt","Nuageux","bewölkt","Nuvoso","Nublado"]
[7,{"$f":"IF(ISBLANK(VLOOKUP(A10,$C$4:$V$10001,1+$A$1)),D10,VLOOKUP(A10,$C$4:$V$10001,1+$A$1))","v":"Rain"},7,"Rain","regen","Pluvieux","Regen","Lluvioso","Chuva"]
[8,{"$f":"IF(ISBLANK(VLOOKUP(A11,$C$4:$V$10001,1+$A$1)),D11,VLOOKUP(A11,$C$4:$V$10001,1+$A$1))","v":"Dusk"},8,"Dusk","schemer","Crépuscule","Dämmerung","Oscuro","Escuro"]
[9,{"$f":"IF(ISBLANK(VLOOKUP(A12,$C$4:$V$10001,1+$A$1)),D12,VLOOKUP(A12,$C$4:$V$10001,1+$A$1))","v":"Night"},9,"Night","donker","Nuit","Nacht","Nocturno","Noite"]
[10,null,10]
[11,{"$f":"IF(ISBLANK(VLOOKUP(A14,$C$4:$V$10001,1+$A$1)),D14,VLOOKUP(A14,$C$4:$V$10001,1+$A$1))","v":" > 75%"},11," > 75%"," > 75%","> 75%"," > 75%"," > 75%"," > 75%"]
[12,{"$f":"IF(ISBLANK(VLOOKUP(A15,$C$4:$V$10001,1+$A$1)),D15,VLOOKUP(A15,$C$4:$V$10001,1+$A$1))","v":" 50% - 75%"},12," 50% - 75%"," 50% - 75%","50% - 75%"," 50% - 75%"," 50% - 75%"," 50% - 75%"]
[13,{"$f":"IF(ISBLANK(VLOOKUP(A16,$C$4:$V$10001,1+$A$1)),D16,VLOOKUP(A16,$C$4:$V$10001,1+$A$1))","v":" about 50%"},13," about 50%"," circa 50%","Environ 50%","etwa 50%","alrededor 50%","Cerca de 50%"]
[14,{"$f":"IF(ISBLANK(VLOOKUP(A17,$C$4:$V$10001,1+$A$1)),D17,VLOOKUP(A17,$C$4:$V$10001,1+$A$1))","v":" 25% - 50%  "},14," 25% - 50%  "," 25% - 50%  ","25% - 50%"," 25% - 50%"," 25% - 50%  "," 25% - 50%  "]
[15,{"$f":"IF(ISBLANK(VLOOKUP(A18,$C$4:$V$10001,1+$A$1)),D18,VLOOKUP(A18,$C$4:$V$10001,1+$A$1))","v":"< 25%"},15,"< 25%","< 25%","< 25%","< 25%","< 25%","< 25%"]
[16,null,16]
[17,{"$f":"IF(ISBLANK(VLOOKUP(A20,$C$4:$V$10001,1+$A$1)),D20,VLOOKUP(A20,$C$4:$V$10001,1+$A$1))","v":"OK"},17,"OK","Accoord","Accepté","OK","OK","OK"]
[18,{"$f":"IF(ISBLANK(VLOOKUP(A21,$C$4:$V$10001,1+$A$1)),D21,VLOOKUP(A21,$C$4:$V$10001,1+$A$1))","v":"Fail"},18,"Fail","Niet accoord","Refusé","Mangel","Fallo","Falha"]
[19,null,19]
[20,{"$f":"IF(ISBLANK(VLOOKUP(A23,$C$4:$V$10001,1+$A$1)),D23,VLOOKUP(A23,$C$4:$V$10001,1+$A$1))","v":"Yes"},20,"Yes","Ja","Oui","Ja","Sí","Sim"]
[21,"No",21,"No","Nee","Non","Nein","No","Não"]
[22,"Irrelevant",22,"Irrelevant","Irrelevant","Sans rapport","unzutreffend","No aplica","Irrelevante"]
[23,"Clear signing",23,"Clear signing","Duidelijke bebording","Signalisation claire","verständliche Beschilderung","Señalización clara","Sinalização clara"]
[24,"Incomplete signing",24,"Incomplete signing","Incomplete bebording","Signalisation incomplète","unvollständige Beschilderung","Señalización incompleta","Sinalização incompleta"]
[25,"No signing",25,"No signing","Geen bebording","Pas de signalisation","keine Beschilderung","No hay señalización","Sem sinalização"]
[26,null,26]
[27,{"$f":"IF(ISBLANK(VLOOKUP(A30,$C$4:$V$10001,1+$A$1)),D30,VLOOKUP(A30,$C$4:$V$10001,1+$A$1))","v":"0%-2%"},27,"0%-2%","0%-2%","0% - 2 %","0%-2%","0%-2%","0%-2%"]
[28,{"$f":"IF(ISBLANK(VLOOKUP(A31,$C$4:$V$10001,1+$A$1)),D31,VLOOKUP(A31,$C$4:$V$10001,1+$A$1))","v":"2%-5%"},28,"2%-5%","2%-5%","2% - 5 %","2%-5%","2%-5%","2%-5%"]
[29,{"$f":"IF(ISBLANK(VLOOKUP(A32,$C$4:$V$10001,1+$A$1)),D32,VLOOKUP(A32,$C$4:$V$10001,1+$A$1))","v":"Above 5%"},29,"Above 5%","> 5%","Supérieur à 5%","über 5%","Más de 5%","Acima de 5%"]
[30,null,30]
[31,{"$f":"IF(ISBLANK(VLOOKUP(A34,$C$4:$V$10001,1+$A$1)),D34,VLOOKUP(A34,$C$4:$V$10001,1+$A$1))","v":"Yes "},31,"Yes ","Ja","Oui","Ja","Sí","Sim"]
[32,{"$f":"IF(ISBLANK(VLOOKUP(A35,$C$4:$V$10001,1+$A$1)),D35,VLOOKUP(A35,$C$4:$V$10001,1+$A$1))","v":"No protection"},32,"No protection","Geen bescherming voor wielen","Pas de protection","kein Schutz","Sin protección","Sem proteção"]
[33,{"$f":"IF(ISBLANK(VLOOKUP(A36,$C$4:$V$10001,1+$A$1)),D36,VLOOKUP(A36,$C$4:$V$10001,1+$A$1))","v":"No kerbs in entry/exit area"},33,"No kerbs in entry/exit area","Geen trottoirbanden bij in/uitrit","Pas de courbes dans la zone entrée/sortie","Keine Schrammborde im Ein-/Ausfahrtsbereich","Sin bordillos en zonas de entrada/salida","Não há lancil junto às entrada/saída"]
[34,null,34]
[35,{"$f":"IF(ISBLANK(VLOOKUP(A38,$C$4:$V$10001,1+$A$1)),D38,VLOOKUP(A38,$C$4:$V$10001,1+$A$1))","v":"Anti slip"},35,"Anti slip","Anti slip","Anti-dérapant","rutschhemmend","Antideslizante","Anti deslizamento"]
[36,{"$f":"IF(ISBLANK(VLOOKUP(A39,$C$4:$V$10001,1+$A$1)),D39,VLOOKUP(A39,$C$4:$V$10001,1+$A$1))","v":"Slippery when wet"},36,"Slippery when wet","Glad bij nat wegdek","Glissant si mouillé","rutschig wenn naß","Deslizante con piso húmedo","Escorregadio quando molhado"]
[37,null,37]
[38,{"$f":"IF(ISBLANK(VLOOKUP(A41,$C$4:$V$10001,1+$A$1)),D41,VLOOKUP(A41,$C$4:$V$10001,1+$A$1))","v":"< 3 m"},38,"< 3 m","< 3 m","< 3 m","< 3 m","< 3 m","< 3 m"]
[39,{"$f":"IF(ISBLANK(VLOOKUP(A42,$C$4:$V$10001,1+$A$1)),D42,VLOOKUP(A42,$C$4:$V$10001,1+$A$1))","v":"3m – 3.3m"},39,"3m – 3.3m","3m - 3.3m","3m – 3.3m","3m - 3.3m","3m – 3.3m","3m – 3.3m"]
[40,{"$f":"IF(ISBLANK(VLOOKUP(A43,$C$4:$V$10001,1+$A$1)),D43,VLOOKUP(A43,$C$4:$V$10001,1+$A$1))","v":"> 3.3m"},40,"> 3.3m","> 3.3m","> 3.3m","> 3.3m","> 3.3m","> 3.3m"]
[41,null,41]
[42,{"$f":"IF(ISBLANK(VLOOKUP(A45,$C$4:$V$10001,1+$A$1)),D45,VLOOKUP(A45,$C$4:$V$10001,1+$A$1))","v":"Pillar does not intrude into the parking area"},42,"Pillar does not intrude into the parking area","Kolom staat compleet buiten het parkeervak","Pilier n’envahissant pas la surface de stationnement","Stütze beeinträchtigt den Stellplatz nicht","Pilar no invade la zona de estacionamiento","Pilar não invade a área de estacionamento"]
[43,{"$f":"IF(ISBLANK(VLOOKUP(A46,$C$4:$V$10001,1+$A$1)),D46,VLOOKUP(A46,$C$4:$V$10001,1+$A$1))","v":"Pillar at beginning of stall"},43,"Pillar at beginning of stall","Kolom aan het begin van het parkeervak","Pilier en début d’aire de stationnement","Stütze am Beginn des Stellplatzes","Pilar al principio de la plaza","Pilar no início do lugar"]
[44,{"$f":"IF(ISBLANK(VLOOKUP(A47,$C$4:$V$10001,1+$A$1)),D47,VLOOKUP(A47,$C$4:$V$10001,1+$A$1))","v":"Pillar next to car door"},44,"Pillar next to car door","Kolom naast het autoportier","Pilier à hauteur des portières de véhicule","Stütze nahe der Fahrzeugtür","Pilar junto a la puerta del vehículo","Pilar ao lado da porta do veículo"]
[45,{"$f":"IF(ISBLANK(VLOOKUP(A48,$C$4:$V$10001,1+$A$1)),D48,VLOOKUP(A48,$C$4:$V$10001,1+$A$1))","v":"Pillar at back of stall but intrudes into the parking area"},45,"Pillar at back of stall but intrudes into the parking area","Kolom aan het eind van het parkeervak, maar beinvloedt het parkeren","Pilier en fond de l’aire de stationnement mais mais déborde sur celle-ci","Stütze am Stellplatzende aber beeinträchtigt den Stellplatz","Pilar en el fondo de plaza pero invade la zona de estacionamiento","Pilar recuado, mas invade a área de estacionamento"]
[46,null,46]
[47,{"$f":"IF(ISBLANK(VLOOKUP(A50,$C$4:$V$10001,1+$A$1)),D50,VLOOKUP(A50,$C$4:$V$10001,1+$A$1))","v":"Good"},47,"Good","Goed","Bon","Gut","Buena","Bom"]
[48,{"$f":"IF(ISBLANK(VLOOKUP(A51,$C$4:$V$10001,1+$A$1)),D51,VLOOKUP(A51,$C$4:$V$10001,1+$A$1))","v":"Medium"},48,"Medium","Acceptabel","Moyen","Mittel","Media","Médio"]
[49,{"$f":"IF(ISBLANK(VLOOKUP(A52,$C$4:$V$10001,1+$A$1)),D52,VLOOKUP(A52,$C$4:$V$10001,1+$A$1))","v":"Bad"},49,"Bad","Slecht","Mauvais","Schlecht","Mala","Mau"]
[50,null,50]
[51,{"$f":"IF(ISBLANK(VLOOKUP(A54,$C$4:$V$10001,1+$A$1)),D54,VLOOKUP(A54,$C$4:$V$10001,1+$A$1))","v":"Angle 76°-90°"},51,"Angle 76°-90°","Parkeerhoek 76º-90º","Angle 76°-90°","Winkel 76°-90°","Ángulo 76°-90°","Ângulo 76°-90°"]
[52,{"$f":"IF(ISBLANK(VLOOKUP(A55,$C$4:$V$10001,1+$A$1)),D55,VLOOKUP(A55,$C$4:$V$10001,1+$A$1))","v":"Angle  45°-75°"},52,"Angle  45°-75°","Parkeerhoek  45º-75º","Angle  45°-75°","Winkel 45°-75°","Ángulo  45°-75°","Ângulo  45°-75°"]
[53,null,53]
[54,{"$f":"IF(ISBLANK(VLOOKUP(A57,$C$4:$V$10001,1+$A$1)),D57,VLOOKUP(A57,$C$4:$V$10001,1+$A$1))","v":" 2.25 m - 2.30 m"},54," 2.25 m - 2.30 m"," 2.25 m - 2.30 m","2.25 m - 2.30 m"," 2.25 m - 2.30 m"," 2.25 m - 2.30 m"," 2.25 m - 2.30 m"]
[55," 2.30 m - 2.35 m",55," 2.30 m - 2.35 m"," 2.30 m - 2.35 m","2.30 m - 2.35 m"," 2.30 m - 2.35 m"," 2.30 m - 2.35 m"," 2.30 m - 2.35 m"]
[56," 2.35 m - 2.40 m",56," 2.35 m - 2.40 m"," 2.35 m - 2.40 m","2.35 m - 2.40 m"," 2.35 m - 2.40 m"," 2.35 m - 2.40 m"," 2.35 m - 2.40 m"]
[57," 2.40 m - 2.45 m",57," 2.40 m - 2.45 m"," 2.40 m - 2.45 m","2.40 m - 2.45 m"," 2.40 m - 2.45 m"," 2.40 m - 2.45 m"," 2.40 m - 2.45 m"]
[58," 2.45 m - 2.50 m",58," 2.45 m - 2.50 m"," 2.45 m - 2.50 m","2.45 m - 2.50 m"," 2.45 m - 2.50 m"," 2.45 m - 2.50 m"," 2.45 m - 2.50 m"]
[59," above 2.50 m",59," above 2.50 m"," Meer dan 2.50 m","Supérieur à 2.50m"," über 2.50 m","Más de 2.50 m","acima de 2.50 m"]
[60,null,60]
[61,{"$f":"IF(ISBLANK(VLOOKUP(A64,$C$4:$V$10001,1+$A$1)),D64,VLOOKUP(A64,$C$4:$V$10001,1+$A$1))","v":"Compliant with the table"},61,"Compliant with the table","In overeenstemming met de tabel","Conforme au tableau","(Not yet translated) Compliant with the table","Conforme a la tabla","Em conformidade com a tabela"]
[62,{"$f":"IF(ISBLANK(VLOOKUP(A65,$C$4:$V$10001,1+$A$1)),D65,VLOOKUP(A65,$C$4:$V$10001,1+$A$1))","v":"Up to 30 cm less"},62,"Up to 30 cm less","Tot 30 cm minder","Jusqu’à 30cm de moins","bis zu 30 cm weniger","Hasta 30 cm menos","Até 30 cm a menos"]
[63,{"$f":"IF(ISBLANK(VLOOKUP(A66,$C$4:$V$10001,1+$A$1)),D66,VLOOKUP(A66,$C$4:$V$10001,1+$A$1))","v":"Up to 60 cm less"},63,"Up to 60 cm less","Tot 60 cm minder","Jusqu’à 60cm de moins","bis zu 60 cm weniger","Hasta 60 cm menos","Até 60 cm a menos"]
[64,{"$f":"IF(ISBLANK(VLOOKUP(A67,$C$4:$V$10001,1+$A$1)),D67,VLOOKUP(A67,$C$4:$V$10001,1+$A$1))","v":"More than 60 cm less"},64,"More than 60 cm less",">60 cm minder","Plus de 60cm de moins","über 60 cm weniger","Más de 60 cm menos","Mais de 60 cm a menos"]
[65,null,65]
[{"$f":"C69","v":66},{"$f":"IF(ISBLANK(VLOOKUP(A69,$C$4:$V$10001,1+$A$1)),D69,VLOOKUP(A69,$C$4:$V$10001,1+$A$1))","v":"Anti-Slip"},66,"Anti-Slip","Anti slip","Anti-dérapant","rutschhemmend","Antideslizante","Antiderrapante"]
[67,{"$f":"IF(ISBLANK(VLOOKUP(A70,$C$4:$V$10001,1+$A$1)),D70,VLOOKUP(A70,$C$4:$V$10001,1+$A$1))","v":"Smooth"},{"$f":"+C69+1","v":67},"Smooth","glad","Lisse","weich","Lisa","Suave"]
[68,{"$f":"IF(ISBLANK(VLOOKUP(A71,$C$4:$V$10001,1+$A$1)),D71,VLOOKUP(A71,$C$4:$V$10001,1+$A$1))","v":"No Ramps"},68,"No Ramps","Geen hellingen","Pas de rampe","Keine Rampen","Sin rampas","Sem rampas"]
[69,null,69]
[70,{"$f":"IF(ISBLANK(VLOOKUP(A73,$C$4:$V$10001,1+$A$1)),D73,VLOOKUP(A73,$C$4:$V$10001,1+$A$1))","v":"< 2.00m"},70,"< 2.00m","< 2.00m","< 2.00m","< 2.00m","< 2.00m","< 2.00m"]
[71,{"$f":"IF(ISBLANK(VLOOKUP(A74,$C$4:$V$10001,1+$A$1)),D74,VLOOKUP(A74,$C$4:$V$10001,1+$A$1))","v":"2.00m – 2.10m"},71,"2.00m – 2.10m","2.00m - 2.10m","2.00m – 2.10m","2.00m – 2.10m","2.00m – 2.10m","2.00m – 2.10m"]
[72,{"$f":"IF(ISBLANK(VLOOKUP(A75,$C$4:$V$10001,1+$A$1)),D75,VLOOKUP(A75,$C$4:$V$10001,1+$A$1))","v":"2.10m – 2.20m"},72,"2.10m – 2.20m","2.10m - 2.20m","2.10m – 2.20m","2.10m – 2.20m","2.10m – 2.20m","2.10m – 2.20m"]
[73,{"$f":"IF(ISBLANK(VLOOKUP(A76,$C$4:$V$10001,1+$A$1)),D76,VLOOKUP(A76,$C$4:$V$10001,1+$A$1))","v":"> 2.20m"},73,"> 2.20m","> 2.20m","> 2.20m","> 2.20m","> 2.20m","> 2.20m"]
[74,null,74]
[75,{"$f":"IF(ISBLANK(VLOOKUP(A78,$C$4:$V$10001,1+$A$1)),D78,VLOOKUP(A78,$C$4:$V$10001,1+$A$1))","v":"Yes (automatic or open connection)"},75,"Yes (automatic or open connection)","Ja (automatische deur of open verbinding)","Oui ( ouverture automatique ou connexion ouverte)","Ja (automatisch oder offene Verbindung)","Sí (automáticas o paso abierto)","Sim (automático ou aberta)"]
[76,{"$f":"IF(ISBLANK(VLOOKUP(A79,$C$4:$V$10001,1+$A$1)),D79,VLOOKUP(A79,$C$4:$V$10001,1+$A$1))","v":"Easy to Open"},76,"Easy to Open","Gemakkelijk te openen","Ouverture aisée","Leicht zu öffnen","Apertura fácil","Fácil de abrir"]
[77,{"$f":"IF(ISBLANK(VLOOKUP(A80,$C$4:$V$10001,1+$A$1)),D80,VLOOKUP(A80,$C$4:$V$10001,1+$A$1))","v":"No"},77,"No","Nee",null,"Nein","No","Não"]
[78,null,78]
[79,{"$f":"IF(ISBLANK(VLOOKUP(A82,$C$4:$V$10001,1+$A$1)),D82,VLOOKUP(A82,$C$4:$V$10001,1+$A$1))","v":"Every pedestrian exit"},79,"Every pedestrian exit","Bij elke voetgangersuitgang","Chaque sortie piétons","Jeder Fußgängerausgang","En todas las salidas peatonales","Cada saída pedonal"]
[80,{"$f":"IF(ISBLANK(VLOOKUP(A83,$C$4:$V$10001,1+$A$1)),D83,VLOOKUP(A83,$C$4:$V$10001,1+$A$1))","v":"One location"},80,"One location","Op één locatie","Un seul endroit","Eine Position","Sólo en un lugar","Uma localização"]
[81,{"$f":"IF(ISBLANK(VLOOKUP(A84,$C$4:$V$10001,1+$A$1)),D84,VLOOKUP(A84,$C$4:$V$10001,1+$A$1))","v":"No"},81,"No","Nee","Absent","Nein","No","Não"]
[82,null,82]
[83,{"$f":"IF(ISBLANK(VLOOKUP(A86,$C$4:$V$10001,1+$A$1)),D86,VLOOKUP(A86,$C$4:$V$10001,1+$A$1))","v":"One elevator"},83,"One elevator","Eén lift","Un ascenseur","Ein Aufzug","Un ascensor","Um elevador"]
[84,{"$f":"IF(ISBLANK(VLOOKUP(A87,$C$4:$V$10001,1+$A$1)),D87,VLOOKUP(A87,$C$4:$V$10001,1+$A$1))","v":"Two or more elevators"},84,"Two or more elevators","Twee of meer liften","Deux ascenseurs ou plus","Zwei oder mehr Aufzüge","Dos o más ascensores","Dois ou mais elevadores"]
[85,null,85]
[86,{"$f":"IF(ISBLANK(VLOOKUP(A89,$C$4:$V$10001,1+$A$1)),D89,VLOOKUP(A89,$C$4:$V$10001,1+$A$1))","v":"More Than 8 People"},86,"More Than 8 People","Meer dan 8 personen","Plus e 8 personnes","Mehr als 8 Personen","Más de 8 personas","Mais que 8 pessoas"]
[87,{"$f":"IF(ISBLANK(VLOOKUP(A90,$C$4:$V$10001,1+$A$1)),D90,VLOOKUP(A90,$C$4:$V$10001,1+$A$1))","v":"4 to 8 people"},87,"4 to 8 people","4 - 8 personen","Entre 4 et 8 personnes","4 bis 8 Personen","De 4 a 8 personas","4 a 8 pessoas"]
[88,{"$f":"IF(ISBLANK(VLOOKUP(A91,$C$4:$V$10001,1+$A$1)),D91,VLOOKUP(A91,$C$4:$V$10001,1+$A$1))","v":"Less Than 4"},88,"Less Than 4","Minder dan 4 personen","Moins de 4 personnes","Weniger als 4","Menos de 4 personas","Menos que 4 pessoas"]
[89,null,89]
[90,{"$f":"IF(ISBLANK(VLOOKUP(A93,$C$4:$V$10001,1+$A$1)),D93,VLOOKUP(A93,$C$4:$V$10001,1+$A$1))","v":"no visibility from elevator"},90,"no visibility from elevator","Geen zicht vanuit de lift","Pas de visibilité depuis l’ascenseur","Keine Sicht aus dem Aufzug","no hay visibilidad desde el ascensor","nenhuma visibilidade do elevador"]
[91,{"$f":"IF(ISBLANK(VLOOKUP(A94,$C$4:$V$10001,1+$A$1)),D94,VLOOKUP(A94,$C$4:$V$10001,1+$A$1))","v":"glazed doors/walls"},91,"glazed doors/walls","Glas in deur of wanden","Portes/murs vitré(e)s","Verglaste Türen/Wände","puertas y muros acristalados ","portas de vidros/paredes"]
[92,{"$f":"IF(ISBLANK(VLOOKUP(A95,$C$4:$V$10001,1+$A$1)),D95,VLOOKUP(A95,$C$4:$V$10001,1+$A$1))","v":"no elevator"},92,"no elevator","Geen lift","Pas d’ascenseur","Kein Aufzug","no hay ascensor","sem elevador"]
[93,null,93]
[94,{"$f":"IF(ISBLANK(VLOOKUP(A97,$C$4:$V$10001,1+$A$1)),D97,VLOOKUP(A97,$C$4:$V$10001,1+$A$1))","v":"< 1.5 m"},94,"< 1.5 m","< 1.5 m","< 1.5 m","< 1.5 m","< 1.5 m","< 1.5 m"]
[95,{"$f":"IF(ISBLANK(VLOOKUP(A98,$C$4:$V$10001,1+$A$1)),D98,VLOOKUP(A98,$C$4:$V$10001,1+$A$1))","v":"> 1.5 m"},95,"> 1.5 m","> 1.5 m","> 1.5 m","> 1.5 m","> 1.5 m","> 1.5 m"]
[96,null,96]
[97,{"$f":"IF(ISBLANK(VLOOKUP(A100,$C$4:$V$10001,1+$A$1)),D100,VLOOKUP(A100,$C$4:$V$10001,1+$A$1))","v":"< 90 cm"},97,"< 90 cm","< 90 cm","< 90 cm","< 90 cm","< 90 cm","< 90 cm"]
[98,{"$f":"IF(ISBLANK(VLOOKUP(A101,$C$4:$V$10001,1+$A$1)),D101,VLOOKUP(A101,$C$4:$V$10001,1+$A$1))","v":">= 90 cm"},98,">= 90 cm",">= 90 cm",">= 90 cm",">= 90 cm",">= 90 cm",">= 90 cm"]
[99,null,99]
[100,{"$f":"IF(ISBLANK(VLOOKUP(A103,$C$4:$V$10001,1+$A$1)),D103,VLOOKUP(A103,$C$4:$V$10001,1+$A$1))","v":"Glazed door/wall"},100,"Glazed door/wall","Glazen deur/wand","Portes/murs vitré(e)s","Verglaste Türen/Wände","Puerta/muro acristalado","Porta de vidro/parede"]
[101,{"$f":"IF(ISBLANK(VLOOKUP(A104,$C$4:$V$10001,1+$A$1)),D104,VLOOKUP(A104,$C$4:$V$10001,1+$A$1))","v":"No Glass"},101,"No Glass","Geen glas","Pas de vitres","Kein Glas","Sin cristal","Sem vidro"]
[102,null,102]
[103,{"$f":"IF(ISBLANK(VLOOKUP(A106,$C$4:$V$10001,1+$A$1)),D106,VLOOKUP(A106,$C$4:$V$10001,1+$A$1))","v":"No hand rail"},103,"No hand rail","Geen handreling","Pas de main courante","Kein Handlauf","Sin barandillas","Não tem corrimão"]
[104,{"$f":"IF(ISBLANK(VLOOKUP(A107,$C$4:$V$10001,1+$A$1)),D107,VLOOKUP(A107,$C$4:$V$10001,1+$A$1))","v":"One Side"},104,"One Side","Handreling aan één kant","D’un seul côté","Eine Seite","A un lado","Um lado"]
[105,{"$f":"IF(ISBLANK(VLOOKUP(A108,$C$4:$V$10001,1+$A$1)),D108,VLOOKUP(A108,$C$4:$V$10001,1+$A$1))","v":"Two sides"},105,"Two sides","Handreling aan twee kanten","Des deux côtés","Zwei Seiten","Ambos lados","Dois lados"]
[106,null,106]
[107,{"$f":"IF(ISBLANK(VLOOKUP(A110,$C$4:$V$10001,1+$A$1)),D110,VLOOKUP(A110,$C$4:$V$10001,1+$A$1))","v":"window/grilled"},107,"window/grilled","Raam of rooster","Fenêtres/Grilles","Fenster/vergittert","Ventana/rejilla","janela/grelhas"]
[108,{"$f":"IF(ISBLANK(VLOOKUP(A111,$C$4:$V$10001,1+$A$1)),D111,VLOOKUP(A111,$C$4:$V$10001,1+$A$1))","v":"none"},108,"none","Geen opening","Aucun","Nichts","Ninguna","Nenhum"]
[109,null,109]
[110,{"$f":"IF(ISBLANK(VLOOKUP(A113,$C$4:$V$10001,1+$A$1)),D113,VLOOKUP(A113,$C$4:$V$10001,1+$A$1))","v":"24*7"},110,"24*7","24 * 7","24h/24 - 7j/7","24*7","24*7","24*7"]
[111,{"$f":"IF(ISBLANK(VLOOKUP(A114,$C$4:$V$10001,1+$A$1)),D114,VLOOKUP(A114,$C$4:$V$10001,1+$A$1))","v":"All access hours if not 24*7"},111,"All access hours if not 24*7","Alle openingsuren indien geen 7*24","Durant les heures d’ouverture si pas 24/24 – 7/7","Gesamte Öffnungszeit wenn nicht 24*7","Todas las horas de apertura si no 24*7","Todas as horas de acesso, se não 24*7"]
[112,{"$f":"IF(ISBLANK(VLOOKUP(A115,$C$4:$V$10001,1+$A$1)),D115,VLOOKUP(A115,$C$4:$V$10001,1+$A$1))","v":"Part time/not available"},112,"Part time/not available","Part time of niet beschikbaar","Partiellement / Non disponible","Teilweise/nicht verfügbar","Tiempo parcial/no disponible","Tempo parcial/não disponível"]
[113,null,113]
[114,{"$f":"IF(ISBLANK(VLOOKUP(A117,$C$4:$V$10001,1+$A$1)),D117,VLOOKUP(A117,$C$4:$V$10001,1+$A$1))","v":"24*7"},114,"24*7","24 * 7","24h/24 - 7j/7","24*7","24*7","24*7"]
[115,{"$f":"IF(ISBLANK(VLOOKUP(A118,$C$4:$V$10001,1+$A$1)),D118,VLOOKUP(A118,$C$4:$V$10001,1+$A$1))","v":"During access Hours"},115,"During access Hours","Gedurende toegangsuren","Durant les heures d’ouverture","Während der Öffnungszeiten","Durante horario de apertura","Durante horário de funcionamento"]
[116,{"$f":"IF(ISBLANK(VLOOKUP(A119,$C$4:$V$10001,1+$A$1)),D119,VLOOKUP(A119,$C$4:$V$10001,1+$A$1))","v":"Less than access Hours"},116,"Less than access Hours","Minder dan de toegangsuren","Moins que les heures d’ouverture","Weniger als die Öffnungszeiten","Tiempo parcial","Fora do horário de funcionamento"]
[117,{"$f":"IF(ISBLANK(VLOOKUP(A120,$C$4:$V$10001,1+$A$1)),D120,VLOOKUP(A120,$C$4:$V$10001,1+$A$1))","v":"No"},117,"No","Geen",null,"Nein","No","Não"]
[118,null,118]
[119,{"$f":"IF(ISBLANK(VLOOKUP(A122,$C$4:$V$10001,1+$A$1)),D122,VLOOKUP(A122,$C$4:$V$10001,1+$A$1))","v":"Closed gate/rolling shutter  after access hours"},119,"Closed gate/rolling shutter  after access hours","Afgesloten toegang buiten openingsuren","Portails ou volets fermés en dehors des heures d’ouverture","Geschlossenes Tor/Rollgitter außerhalb der Öffnungszeit","Portón cerrado fuera de horario de apertura","Portão/porta de enrolar fechados depois do horário de funcionamento"]
[120,{"$f":"IF(ISBLANK(VLOOKUP(A123,$C$4:$V$10001,1+$A$1)),D123,VLOOKUP(A123,$C$4:$V$10001,1+$A$1))","v":"Secured: fast opening gate during day"},120,"Secured: fast opening gate during day","Beveiligd: snelle poort gedurende de dag","Sécurisé: portail à ouverture rapide en journée","Gesichert: Schnelllauftor tagsüber","Mecanismo de seguridad de cierre rápido durante horario apertura","Protegido : rápida abertura do portão durante o dia"]
[121,{"$f":"IF(ISBLANK(VLOOKUP(A124,$C$4:$V$10001,1+$A$1)),D124,VLOOKUP(A124,$C$4:$V$10001,1+$A$1))","v":"Secured: slow opening gate during day"},121,"Secured: slow opening gate during day","Beveiligd: langzame poort gedurende de dag","Sécurisé: portail à ouverture lente en journée","Gesichert: langsam öffnendes Tor tagsüber"," Mecanismo de seguridad de cierre lento durante horario apertura","Protegido : portão de abertura lento durante o dia"]
[122,{"$f":"IF(ISBLANK(VLOOKUP(A125,$C$4:$V$10001,1+$A$1)),D125,VLOOKUP(A125,$C$4:$V$10001,1+$A$1))","v":"No provisions"},122,"No provisions","Geen voorzieningen","Pas de dispositif particulier","Keine Sicherung","Sin mecanismo","Não previsto"]
[123,null,123]
[124,{"$f":"IF(ISBLANK(VLOOKUP(A127,$C$4:$V$10001,1+$A$1)),D127,VLOOKUP(A127,$C$4:$V$10001,1+$A$1))","v":"Maximum Aperture Door/gate/rolling shutter <= 15cm"},124,"Maximum Aperture Door/gate/rolling shutter <= 15cm","Toegangsdeur met openingen <= 15 cm","Espace maximum entre barreaux portails/volets : => 15cm","Größte Öffnung in Tür/Tor/Rollgitter <= 15cm","Puerta/portón cuya apertura máxima es <= 15cm","Abertura Máxima da Porta/portão/porta de enrolar <= 15cm"]
[125,{"$f":"IF(ISBLANK(VLOOKUP(A128,$C$4:$V$10001,1+$A$1)),D128,VLOOKUP(A128,$C$4:$V$10001,1+$A$1))","v":"Maximum Aperture Door/gate/rolling shutter > 15cm"},125,"Maximum Aperture Door/gate/rolling shutter > 15cm","Toegangsdeur met openingen > 15 cm","Espace maximum entre barreaux portails/volets :  < 15cm","Größte Öffnung in Tür/Tor/Rollgitter > 15cm","Puerta/portón cuya apertura máxima es > 15cm","Abertura Máxima da Porta/portão/porta de enrolar > 15cm"]
[126,{"$f":"IF(ISBLANK(VLOOKUP(A129,$C$4:$V$10001,1+$A$1)),D129,VLOOKUP(A129,$C$4:$V$10001,1+$A$1))","v":"no provisions"},126,"no provisions","Geen afgesloten toegangsdeur","Pas de barreaux","Keine Öffnung","Ningún tipo de cierre","não previsto"]
[127,{"$f":"IF(ISBLANK(VLOOKUP(A130,$C$4:$V$10001,1+$A$1)),D130,VLOOKUP(A130,$C$4:$V$10001,1+$A$1))","v":"Irrelevant (24 hours opening)"},127,"Irrelevant (24 hours opening)","NVT, 24 uur opening","Sans rapport (ouverture 24h/24)","Unzutreffend (24 Stunden geöffnet)","No aplica (apertura 24h)","Irrelevante (24 horas aberto)"]
[128,null,128]
[129,{"$f":"IF(ISBLANK(VLOOKUP(A132,$C$4:$V$10001,1+$A$1)),D132,VLOOKUP(A132,$C$4:$V$10001,1+$A$1))","v":"<= 15 cm"},129,"<= 15 cm","<= 15 cm","<= 15 cm","<= 15 cm","<= 15 cm","<= 15 cm"]
[{"$f":"C133","v":130},{"$f":"IF(ISBLANK(VLOOKUP(A133,$C$4:$V$10001,1+$A$1)),D133,VLOOKUP(A133,$C$4:$V$10001,1+$A$1))","v":">15 cm or no protection"},130,">15 cm or no protection",">15 cm of geen beveiliging",">15 cm ou absence de protection",">15 cm oder keine Sicherung",">15 cm o sin protección","> 15 cm ou nenhuma proteção"]
[131,{"$f":"IF(ISBLANK(VLOOKUP(A134,$C$4:$V$10001,1+$A$1)),D134,VLOOKUP(A134,$C$4:$V$10001,1+$A$1))","v":"Irrelevant (no external openings)"},{"$f":"+C133+1","v":131},"Irrelevant (no external openings)","NVT, geen openingen naar buiten","Sans rapport (pas d’ouvertures extérieures)","Unzutreffend (keine Öffnungen nach außen)","No aplica (no hay aperturas exteriores)","Irrelevante (sem aberturas externas)"]
[132,null,132]
[133,{"$f":"IF(ISBLANK(VLOOKUP(A136,$C$4:$V$10001,1+$A$1)),D136,VLOOKUP(A136,$C$4:$V$10001,1+$A$1))","v":"Yes/Good"},133,"Yes/Good","Ja/goed","Oui/Bon","Ja/gut","Sí/Buena","Sim/Bom"]
[134,{"$f":"IF(ISBLANK(VLOOKUP(A137,$C$4:$V$10001,1+$A$1)),D137,VLOOKUP(A137,$C$4:$V$10001,1+$A$1))","v":"No/Bad"},134,"No/Bad","Nee/slecht","Non/Mauvais","Nein/schlecht","No/Mala","Não/Mau"]
[135,null,135]
[136,{"$f":"IF(ISBLANK(VLOOKUP(A139,$C$4:$V$10001,1+$A$1)),D139,VLOOKUP(A139,$C$4:$V$10001,1+$A$1))","v":"Good"},136,"Good","Goed","Bon","Gut","Bien","Bom"]
[137,{"$f":"IF(ISBLANK(VLOOKUP(A140,$C$4:$V$10001,1+$A$1)),D140,VLOOKUP(A140,$C$4:$V$10001,1+$A$1))","v":"Adequate"},137,"Adequate","Acceptabel","Adéquat","Befriedigend","Correcto","Adequado"]
[138,{"$f":"IF(ISBLANK(VLOOKUP(A141,$C$4:$V$10001,1+$A$1)),D141,VLOOKUP(A141,$C$4:$V$10001,1+$A$1))","v":"Poor"},138,"Poor","Slecht","Faible","Schlecht","Mal","Pobre"]
[139,{"$f":"IF(ISBLANK(VLOOKUP(A142,$C$4:$V$10001,1+$A$1)),D142,VLOOKUP(A142,$C$4:$V$10001,1+$A$1))","v":"No"},139,"No","Nee","Absent","Nein","No","Não"]
[140,null,140]
[141,{"$f":"IF(ISBLANK(VLOOKUP(A144,$C$4:$V$10001,1+$A$1)),D144,VLOOKUP(A144,$C$4:$V$10001,1+$A$1))","v":"Clear from all locations"},141,"Clear from all locations","Zichtbaar vanaf elke plek","Clairement depuis tous les endroits","Deutlich von allen Standorten","Claramente desde cualquier ubicación","A partir de todos os locais"]
[142,{"$f":"IF(ISBLANK(VLOOKUP(A145,$C$4:$V$10001,1+$A$1)),D145,VLOOKUP(A145,$C$4:$V$10001,1+$A$1))","v":"Clear from most locations"},142,"Clear from most locations","Zichtbaar vanaf de meeste plekken","Clairement depuis la plupart des endroits","Deutlich von den meisten Standorten","La mayor parte de ubicaciones","A partir de maioria dos locais"]
[143,{"$f":"IF(ISBLANK(VLOOKUP(A146,$C$4:$V$10001,1+$A$1)),D146,VLOOKUP(A146,$C$4:$V$10001,1+$A$1))","v":"Clear from some locations"},143,"Clear from some locations","Zichtbaar vanaf somming plekken","Clairement depuis certains endroits","Deutlich von wenigen Standorten","Algunas ubicaciones","A partir de alguns locais"]
[144,{"$f":"IF(ISBLANK(VLOOKUP(A147,$C$4:$V$10001,1+$A$1)),D147,VLOOKUP(A147,$C$4:$V$10001,1+$A$1))","v":"No marking of escape routes"},144,"No marking of escape routes","Geen aanduiding van vluchtroutes","Pas de signalétique vers sorties de secours","Keine Kennzeichnung von Fluchtwegen","No están señalizadas","Não existe identificação dos caminhos de fuga"]
[145,null,145]
[146,{"$f":"IF(ISBLANK(VLOOKUP(A149,$C$4:$V$10001,1+$A$1)),D149,VLOOKUP(A149,$C$4:$V$10001,1+$A$1))","v":"Good"},146,"Good","Goed","Bon","Gut","Bien","Bom"]
[147,{"$f":"IF(ISBLANK(VLOOKUP(A150,$C$4:$V$10001,1+$A$1)),D150,VLOOKUP(A150,$C$4:$V$10001,1+$A$1))","v":"Adequate"},147,"Adequate","Acceptabel","Adéquat","Befriedigend","Correcto","Adequado"]
[148,{"$f":"IF(ISBLANK(VLOOKUP(A151,$C$4:$V$10001,1+$A$1)),D151,VLOOKUP(A151,$C$4:$V$10001,1+$A$1))","v":"Poor"},148,"Poor","Slecht","Faible","Schlecht","Mal","Pobre"]
[149,{"$f":"IF(ISBLANK(VLOOKUP(A152,$C$4:$V$10001,1+$A$1)),D152,VLOOKUP(A152,$C$4:$V$10001,1+$A$1))","v":"None"},149,"None","Geen","Absent","Keine","No","Nenhum"]
[150,{"$f":"IF(ISBLANK(VLOOKUP(A153,$C$4:$V$10001,1+$A$1)),D153,VLOOKUP(A153,$C$4:$V$10001,1+$A$1))","v":"Single Level Car Park"},150,"Single Level Car Park","Eénlaags parkeergarage","Parc de stationnement à un seul niveau","1-geschossiges Parkhaus","Aparcamiento de una única planta","Parque com um único piso"]
[151,null,151]
[152,{"$f":"IF(ISBLANK(VLOOKUP(A155,$C$4:$V$10001,1+$A$1)),D155,VLOOKUP(A155,$C$4:$V$10001,1+$A$1))","v":"Good"},152,"Good","Goed","Bon","Gut","Buena","Bom"]
[153,{"$f":"IF(ISBLANK(VLOOKUP(A156,$C$4:$V$10001,1+$A$1)),D156,VLOOKUP(A156,$C$4:$V$10001,1+$A$1))","v":"Some"},153,"Some","Soms","Quelques ","Einige","Alguna","Alguns"]
[154,{"$f":"IF(ISBLANK(VLOOKUP(A157,$C$4:$V$10001,1+$A$1)),D157,VLOOKUP(A157,$C$4:$V$10001,1+$A$1))","v":"None"},154,"None","Geen","Absent","Keine","Ninguna","Nenhum"]
[155,null,155]
[156,{"$f":"IF(ISBLANK(VLOOKUP(A159,$C$4:$V$10001,1+$A$1)),D159,VLOOKUP(A159,$C$4:$V$10001,1+$A$1))","v":"Numbered including floor identification"},156,"Numbered including floor identification","Nummers met niveau indicatie","Numérotation incluant  identification de l’étage","Nummeriert einschießlich Geschoßidentifizierung","Numeración incluye identificación de planta","Numerados, incluindo identificação no chão"]
[157,{"$f":"IF(ISBLANK(VLOOKUP(A160,$C$4:$V$10001,1+$A$1)),D160,VLOOKUP(A160,$C$4:$V$10001,1+$A$1))","v":"Just numbers"},157,"Just numbers","Alleen nummers","Juste numérotation","Nur nummeriert","Sólo números","Só números"]
[158,{"$f":"IF(ISBLANK(VLOOKUP(A161,$C$4:$V$10001,1+$A$1)),D161,VLOOKUP(A161,$C$4:$V$10001,1+$A$1))","v":"None"},158,"None","Geen","Absent","Keine","Ninguna","Nenhum"]
[159,null,159]
[160,{"$f":"IF(ISBLANK(VLOOKUP(A163,$C$4:$V$10001,1+$A$1)),D163,VLOOKUP(A163,$C$4:$V$10001,1+$A$1))","v":"Zero"},160,"Zero","nul","Zéro","null","Cero","Zero"]
[161,{"$f":"IF(ISBLANK(VLOOKUP(A164,$C$4:$V$10001,1+$A$1)),D164,VLOOKUP(A164,$C$4:$V$10001,1+$A$1))","v":"One"},161,"One","een","Un","ein","Un","Um"]
[162,{"$f":"IF(ISBLANK(VLOOKUP(A165,$C$4:$V$10001,1+$A$1)),D165,VLOOKUP(A165,$C$4:$V$10001,1+$A$1))","v":"Two"},162,"Two","twee","Deux","zewi","Dos","Dois"]
[163,{"$f":"IF(ISBLANK(VLOOKUP(A166,$C$4:$V$10001,1+$A$1)),D166,VLOOKUP(A166,$C$4:$V$10001,1+$A$1))","v":"Three or More"},163,"Three or More","drie of meer","Trois ou plus","drei oder mehr","Tres o más","Três ou Mais"]
[164,null,164]
[165,{"$f":"IF(ISBLANK(VLOOKUP(A168,$C$4:$V$10001,1+$A$1)),D168,VLOOKUP(A168,$C$4:$V$10001,1+$A$1))","v":"One pay station"},165,"One pay station","Een betaalautomaat","Une seule borne d’encaissement","Ein Bezahlstation","Un punto de pago","Uma estação de pagamento"]
[166,{"$f":"IF(ISBLANK(VLOOKUP(A169,$C$4:$V$10001,1+$A$1)),D169,VLOOKUP(A169,$C$4:$V$10001,1+$A$1))","v":"More than one"},166,"More than one","Meer betaalautomaten","Plus qu’une borne d’encaissement","Mehr als eine","Más de uno","Mais que uma"]
[167,{"$f":"IF(ISBLANK(VLOOKUP(A170,$C$4:$V$10001,1+$A$1)),D170,VLOOKUP(A170,$C$4:$V$10001,1+$A$1))","v":"One at each pedestrian entrance"},167,"One at each pedestrian entrance","Minstens één bij elke reguliere voetgangersingang","Une à chaque entrée piétons,excepté sortie secours","Eine an jedem Fußgängerzugang (außer reine Fluchtwege)","Uno en cada acceso peatonal","Um em cada entrada pedonal"]
[168,{"$f":"IF(ISBLANK(VLOOKUP(A171,$C$4:$V$10001,1+$A$1)),D171,VLOOKUP(A171,$C$4:$V$10001,1+$A$1))","v":"More than one at each pedestrian entrance"},168,"More than one at each pedestrian entrance","Meer dan gemiddeld één per voetgangerstoegang","Plus d’une borne à chaque entrée piétons","Eine an jedem Fußgängerzugang","Más de uno en cada acceso peatonal","Mais que um em cada entrada pedonal"]
[169,null,169]
[170,{"$f":"IF(ISBLANK(VLOOKUP(A173,$C$4:$V$10001,1+$A$1)),D173,VLOOKUP(A173,$C$4:$V$10001,1+$A$1))","v":"One"},170,"One","Een","Une","Eine","Uno","Um"]
[171,{"$f":"IF(ISBLANK(VLOOKUP(A174,$C$4:$V$10001,1+$A$1)),D174,VLOOKUP(A174,$C$4:$V$10001,1+$A$1))","v":"< 1 for every 50 spaces"},171,"< 1 for every 50 spaces","<1 per 50 plaatsen","< 1 par tranche de 50 places","< 1 pro 50 Stellplätze","< 1 cada 50 plazas","< 1 para cada 50 lugares"]
[172,{"$f":"IF(ISBLANK(VLOOKUP(A175,$C$4:$V$10001,1+$A$1)),D175,VLOOKUP(A175,$C$4:$V$10001,1+$A$1))","v":">1 for every 50 spaces"},172,">1 for every 50 spaces",">1 per 50 plaatsen","> 1 par tranche de 50 places","> 1 pro 50 Stellplätze",">1 cada 50 plazas","> 1 para cada 50 lugares"]
[173,null,173]
[174,{"$f":"IF(ISBLANK(VLOOKUP(A177,$C$4:$V$10001,1+$A$1)),D177,VLOOKUP(A177,$C$4:$V$10001,1+$A$1))","v":"Unisex"},174,"Unisex","M/V gecombineerd","Unique","unisex","Unisex","Unisexo"]
[175,{"$f":"IF(ISBLANK(VLOOKUP(A178,$C$4:$V$10001,1+$A$1)),D178,VLOOKUP(A178,$C$4:$V$10001,1+$A$1))","v":"Male/Female Separated"},175,"Male/Female Separated","Apart voor M en V","Hommes/Femmes séparés","Männer/Frauen getrennt","Separación hombres/mujeres","Masculino/Feminino Separado"]
[176,null,176]
[177,{"$f":"IF(ISBLANK(VLOOKUP(A180,$C$4:$V$10001,1+$A$1)),D180,VLOOKUP(A180,$C$4:$V$10001,1+$A$1))","v":"Coloured pillars"},177,"Coloured pillars","Geschilderde kolommen","Piliers peints","Farbige Stützen","Pilares pintados","Pilares coloridos"]
[178,{"$f":"IF(ISBLANK(VLOOKUP(A181,$C$4:$V$10001,1+$A$1)),D181,VLOOKUP(A181,$C$4:$V$10001,1+$A$1))","v":"No/Concrete grey"},178,"No/Concrete grey","Nee, beton grijs","Non peints / béton brut","Nein/Betongrau","No/hormigón gris","Não/Betão cinzento"]
[179,null,179]
[180,{"$f":"IF(ISBLANK(VLOOKUP(A183,$C$4:$V$10001,1+$A$1)),D183,VLOOKUP(A183,$C$4:$V$10001,1+$A$1))","v":"Coloured walls"},180,"Coloured walls","Geschilderde wanden","Murs peints","Farbige Wände","Muros pintados","Paredes coloridas"]
[181,{"$f":"IF(ISBLANK(VLOOKUP(A184,$C$4:$V$10001,1+$A$1)),D184,VLOOKUP(A184,$C$4:$V$10001,1+$A$1))","v":"No/Concrete grey"},181,"No/Concrete grey","Nee, beton grijs","Non peints / béton brut","Nein/Betongrau","No/hormigón gris","Não/Betão cinzento"]
[182,null,182]
[183,{"$f":"IF(ISBLANK(VLOOKUP(A186,$C$4:$V$10001,1+$A$1)),D186,VLOOKUP(A186,$C$4:$V$10001,1+$A$1))","v":"More than one recharging point"},183,"More than one recharging point","Meerdere laadpunten","Plusieurs bornes de charge","Mehr als eine Aufladestation","Más de un punto de recarga","Mais do que um ponto de recarga"]
[184,{"$f":"IF(ISBLANK(VLOOKUP(A187,$C$4:$V$10001,1+$A$1)),D187,VLOOKUP(A187,$C$4:$V$10001,1+$A$1))","v":"One recharging point"},184,"One recharging point","Een laadpunt","Une seule borne de charge","eine Aufladestation","Un punto de recarga","Um ponto de recarga"]
[185,{"$f":"IF(ISBLANK(VLOOKUP(A188,$C$4:$V$10001,1+$A$1)),D188,VLOOKUP(A188,$C$4:$V$10001,1+$A$1))","v":"None"},185,"None","Geen","Absent","keine","Ninguno","Nenhum"]
[186,null,186]
[187,{"$f":"IF(ISBLANK(VLOOKUP(A190,$C$4:$V$10001,1+$A$1)),D190,VLOOKUP(A190,$C$4:$V$10001,1+$A$1))","v":"To/from all levels"},187,"To/from all levels","Naar/van alle niveaus","Vers/depuis tous les étages","Zu/von allen Geschossen","Desde/hasta todas las plantas","Para/de todos os níveis"]
[188,{"$f":"IF(ISBLANK(VLOOKUP(A191,$C$4:$V$10001,1+$A$1)),D191,VLOOKUP(A191,$C$4:$V$10001,1+$A$1))","v":"To/from some levels"},188,"To/from some levels","Naar/van enkele niveaus","De/vers certains étages","Zu/von einigen Geschossen","Desde/hasta algunas plantas","Para/ de alguns níveis"]
[189,{"$f":"IF(ISBLANK(VLOOKUP(A192,$C$4:$V$10001,1+$A$1)),D192,VLOOKUP(A192,$C$4:$V$10001,1+$A$1))","v":"No Escalators or Travellator"},189,"No Escalators or Travellator","Geen roltrap","Pas d’escalators ou tapis roulants","Keine Rolltreppen oder Rollsteige","Sin escaleras mecánicas ni cintas","Não há escadas rolantes ou passadeiras rolantes"]
[190,null,190]
[191,{"$f":"IF(ISBLANK(VLOOKUP(A194,$C$4:$V$10001,1+$A$1)),D194,VLOOKUP(A194,$C$4:$V$10001,1+$A$1))","v":" <10%"},191," <10%"," <10%","<10%"," <10%"," <10%"," <10%"]
[192,{"$f":"IF(ISBLANK(VLOOKUP(A195,$C$4:$V$10001,1+$A$1)),D195,VLOOKUP(A195,$C$4:$V$10001,1+$A$1))","v":" 10-15%"},192," 10-15%"," 10-15%","10-15%"," 10-15%"," 10-15%"," 10-15%"]
[{"$f":"C196","v":193},{"$f":"IF(ISBLANK(VLOOKUP(A196,$C$4:$V$10001,1+$A$1)),D196,VLOOKUP(A196,$C$4:$V$10001,1+$A$1))","v":">15%"},193,">15%",">15%",">15%",">15%",">15%",">15%"]
[194,{"$f":"IF(ISBLANK(VLOOKUP(A197,$C$4:$V$10001,1+$A$1)),D197,VLOOKUP(A197,$C$4:$V$10001,1+$A$1))","v":"no ramps"},194,"no ramps","Geen hellingbanen","Pas de rampes","Keine Rampen","sin rampas","Sem rampas"]
[195,null,{"$f":"+C197+1","v":195}]
[196,{"$f":"IF(ISBLANK(VLOOKUP(A199,$C$4:$V$10001,1+$A$1)),D199,VLOOKUP(A199,$C$4:$V$10001,1+$A$1))","v":"< 3m"},196,"< 3m","< 3m","< 3m","< 3m","< 3m","< 3m"]
[197,{"$f":"IF(ISBLANK(VLOOKUP(A200,$C$4:$V$10001,1+$A$1)),D200,VLOOKUP(A200,$C$4:$V$10001,1+$A$1))","v":"3m - 3.3m"},197,"3m - 3.3m","3m - 3.3m","3m - 3.3m","3m - 3.3m","3m - 3.3m","3m - 3.3m"]
[198,{"$f":"IF(ISBLANK(VLOOKUP(A201,$C$4:$V$10001,1+$A$1)),D201,VLOOKUP(A201,$C$4:$V$10001,1+$A$1))","v":">3.3m"},198,">3.3m",">3.3m",">3.3m",">3.3m",">3.3m",">3.3m"]
[199,{"$f":"IF(ISBLANK(VLOOKUP(A202,$C$4:$V$10001,1+$A$1)),D202,VLOOKUP(A202,$C$4:$V$10001,1+$A$1))","v":"no ramps"},199,"no ramps","Geen hellingbanen","Pas de rampes","Keine Rampen","sin rampas","Sem rampas"]
[200,null,200]
[201,{"$f":"IF(ISBLANK(VLOOKUP(A204,$C$4:$V$10001,1+$A$1)),D204,VLOOKUP(A204,$C$4:$V$10001,1+$A$1))","v":"< 4m"},201,"< 4m","< 4m","< 4m","< 4m","< 4m","< 4m"]
[202,{"$f":"IF(ISBLANK(VLOOKUP(A205,$C$4:$V$10001,1+$A$1)),D205,VLOOKUP(A205,$C$4:$V$10001,1+$A$1))","v":"4m - 4.3m"},202,"4m - 4.3m","4m - 4.3m","4m - 4.3m","4m - 4.3m","4m - 4.3m","4m - 4.3m"]
[203,{"$f":"IF(ISBLANK(VLOOKUP(A206,$C$4:$V$10001,1+$A$1)),D206,VLOOKUP(A206,$C$4:$V$10001,1+$A$1))","v":">4.3m"},203,">4.3m",">4.3m",">4.3m",">4.3m",">4.3m",">4.3m"]
[204,{"$f":"IF(ISBLANK(VLOOKUP(A207,$C$4:$V$10001,1+$A$1)),D207,VLOOKUP(A207,$C$4:$V$10001,1+$A$1))","v":"no ramps"},204,"no ramps","no ramps","Pas de rampes","Keine Rampen","sin rampas","          Sem rampas"]
[205,null,205]
[206,{"$f":"IF(ISBLANK(VLOOKUP(A209,$C$4:$V$10001,1+$A$1)),D209,VLOOKUP(A209,$C$4:$V$10001,1+$A$1))","v":"< 9m"},206,"< 9m","< 9m","< 9m","< 9m","< 9m","< 9m"]
[207,{"$f":"IF(ISBLANK(VLOOKUP(A210,$C$4:$V$10001,1+$A$1)),D210,VLOOKUP(A210,$C$4:$V$10001,1+$A$1))","v":"9m – 10m"},207,"9m – 10m","9m - 10m","9m – 10m","9m – 10m","9m – 10m","9m – 10m"]
[208,{"$f":"IF(ISBLANK(VLOOKUP(A211,$C$4:$V$10001,1+$A$1)),D211,VLOOKUP(A211,$C$4:$V$10001,1+$A$1))","v":">10m"},208,">10m",">10m","> 10m",">10m",">10m",">10m"]
[209,{"$f":"IF(ISBLANK(VLOOKUP(A212,$C$4:$V$10001,1+$A$1)),D212,VLOOKUP(A212,$C$4:$V$10001,1+$A$1))","v":"no ramps"},209,"no ramps","Geen hellingbanen ","Pas de rampes","Keine Rampen","sin rampas","Sem rampas"]
[210,null,210]
[211,{"$f":"IF(ISBLANK(VLOOKUP(A214,$C$4:$V$10001,1+$A$1)),D214,VLOOKUP(A214,$C$4:$V$10001,1+$A$1))","v":" <7.5m"},211," <7.5m"," <7.5m","< 7.5m"," <7.5m"," <7.5m"," <7.5m"]
[212,{"$f":"IF(ISBLANK(VLOOKUP(A215,$C$4:$V$10001,1+$A$1)),D215,VLOOKUP(A215,$C$4:$V$10001,1+$A$1))","v":"7.5m – 9m"},212,"7.5m – 9m","7.5m - 9m","7.5m – 9m","7.5m – 9m","7.5m – 9m","7.5m – 9m"]
[213,{"$f":"IF(ISBLANK(VLOOKUP(A216,$C$4:$V$10001,1+$A$1)),D216,VLOOKUP(A216,$C$4:$V$10001,1+$A$1))","v":">9m"},213,">9m",">9m","> 9m",">9m",">9m",">9m"]
[214,{"$f":"IF(ISBLANK(VLOOKUP(A217,$C$4:$V$10001,1+$A$1)),D217,VLOOKUP(A217,$C$4:$V$10001,1+$A$1))","v":"no ramps"},214,"no ramps","Geen hellingbanen ","Pas de rampes","Keine Rampen","sin rampas","Sem rampas"]
[215,null,215]
[216,{"$f":"IF(ISBLANK(VLOOKUP(A219,$C$4:$V$10001,1+$A$1)),D219,VLOOKUP(A219,$C$4:$V$10001,1+$A$1))","v":"<5%"},216,"<5%","<5%","< 5%","<5%","<5%","<5%"]
[217,{"$f":"IF(ISBLANK(VLOOKUP(A220,$C$4:$V$10001,1+$A$1)),D220,VLOOKUP(A220,$C$4:$V$10001,1+$A$1))","v":"5% -7%"},217,"5% -7%","5% -7%","5% – 7%","5% -7%","5% -7%","5% -7%"]
[218,{"$f":"IF(ISBLANK(VLOOKUP(A221,$C$4:$V$10001,1+$A$1)),D221,VLOOKUP(A221,$C$4:$V$10001,1+$A$1))","v":">7%"},218,">7%",">7%","> 7%",">7%",">7%",">7%"]
[219,{"$f":"IF(ISBLANK(VLOOKUP(A222,$C$4:$V$10001,1+$A$1)),D222,VLOOKUP(A222,$C$4:$V$10001,1+$A$1))","v":"no gradient"},219,"no gradient","Geen helling, vlakke vloer","Pas d’inclinaison","Kein Gefälle","sin pendiente","Sem rampas"]
[220,null,220]
[221,{"$f":"IF(ISBLANK(VLOOKUP(A224,$C$4:$V$10001,1+$A$1)),D224,VLOOKUP(A224,$C$4:$V$10001,1+$A$1))","v":"multi-storey open daylight"},221,"multi-storey open daylight","bovengronds, open met daglicht",null,"Offenes Parkhaus mit Tageslicht","en altura con luz natural","Silo aberto, com luz natural"]
[222,{"$f":"IF(ISBLANK(VLOOKUP(A225,$C$4:$V$10001,1+$A$1)),D225,VLOOKUP(A225,$C$4:$V$10001,1+$A$1))","v":"multi-storey closed no daylight"},222,"multi-storey closed no daylight","bovengronds, geen daglicht toetreding",null,"Geschlossenes Parkhaus ohne Tageslicht","en altura sin luz natural","Silo fechado sem luz natural"]
[223,{"$f":"IF(ISBLANK(VLOOKUP(A226,$C$4:$V$10001,1+$A$1)),D226,VLOOKUP(A226,$C$4:$V$10001,1+$A$1))","v":"underground"},223,"underground","ondergronds",null,"unterirdisch","subterráneo","subterrâneo"]
[224,null,224]
[225,{"$f":"IF(ISBLANK(VLOOKUP(A228,$C$4:$V$10001,1+$A$1)),D228,VLOOKUP(A228,$C$4:$V$10001,1+$A$1))","v":"split level"},225,"split level","split level",null,"split level","semi-plantas","Semi-pisos"]
[226,{"$f":"IF(ISBLANK(VLOOKUP(A229,$C$4:$V$10001,1+$A$1)),D229,VLOOKUP(A229,$C$4:$V$10001,1+$A$1))","v":"floors with helicons or straight ramps"},226,"floors with helicons or straight ramps","vlakke vloer met spiraal of rechte hellingbanen",null,"Ebenen mit gewendelten oder geraden Rampen","plantas conectadas mediante rampas helicoidales o rectas","pisos com helicoidais ou rampas retas"]
[227,{"$f":"IF(ISBLANK(VLOOKUP(A230,$C$4:$V$10001,1+$A$1)),D230,VLOOKUP(A230,$C$4:$V$10001,1+$A$1))","v":"ramped parking floors"},227,"ramped parking floors","hellende parkeervloeren",null,"Ebenen mit Gefälle (Parkrampe)",null,"pisos de estacionamento em rampa"]
[228,{"$f":"IF(ISBLANK(VLOOKUP(A231,$C$4:$V$10001,1+$A$1)),D231,VLOOKUP(A231,$C$4:$V$10001,1+$A$1))","v":"other"},228,"other","overig",null,"andere","otros","outro"]
[229,null,229]
[230,{"$f":"IF(ISBLANK(VLOOKUP(A233,$C$4:$V$10001,1+$A$1)),D233,VLOOKUP(A233,$C$4:$V$10001,1+$A$1))","v":"barrier/gate control"},230,"barrier/gate control","slagboom of afsluitpoort",null,"Parkhaus mit Schranke / Tor","control mediante barreras/puertas","barreira / controle de portão"]
[231,{"$f":"IF(ISBLANK(VLOOKUP(A234,$C$4:$V$10001,1+$A$1)),D234,VLOOKUP(A234,$C$4:$V$10001,1+$A$1))","v":"P&D control"},231,"P&D control","ticketautomaten",null,"Parkhaus mit Parkscheinautomaten","parquímetros","Controle por parquímetro"]
[232,{"$f":"IF(ISBLANK(VLOOKUP(A235,$C$4:$V$10001,1+$A$1)),D235,VLOOKUP(A235,$C$4:$V$10001,1+$A$1))","v":"other"},232,"other","overig",null,"andere","otros","outro"]
[233,{"$f":"VLOOKUP(A236,$C$4:$V$10001,1+$A$1)","v":0},233]
[234,0,234]
[235,0,235]
[236,0,236]
[237,0,237]
[238,0,238]
[239,0,239]
[240,0,240]
[241,0,241]
[242,0,242]
[243,0,243]
[244,0,244]
[245,0,245]
[246,0,246]
[247,0,247]
[248,0,248]
[249,0,249]
[250,0,250]
[251,0,251]
[252,0,252]
[253,0,253]
[254,0,254]
[255,0,255]
[256,0,256]
[{"$f":"C260","v":257},0,257]
[258,0,258]
[259,0,{"$f":"+C261+1","v":259}]
[260,0,260]
[261,0,261]
[262,0,262]
[263,0,263]
[264,0,264]
[265,0,265]
[266,0,266]
[267,0,267]
[268,0,268]
[269,0,269]
[270,0,270]
[271,0,271]
[272,0,272]
[273,0,273]
[274,0,274]
[275,0,275]
[276,0,276]
[277,0,277]
[278,0,278]
[279,0,279]
[280,0,280]
[281,0,281]
[282,0,282]
[283,0,283]
[284,0,284]
[285,0,285]
[286,0,286]
[287,0,287]
[288,0,288]
[289,0,289]
[290,0,290]
[291,0,291]
[292,0,292]
[293,0,293]
[294,0,294]
[295,0,295]
[296,0,296]
[297,{"$f":"VLOOKUP(A300,$C$4:$V$10001,1+$A$1)","v":0},297]
[298,0,298]
[299,0,299]
[300,0,300]
[301,0,301]
[302,0,302]
[303,0,303]
[304,0,304]
[305,0,305]
[306,0,306]
[307,0,307]
[308,0,308]
[309,0,309]
[310,0,310]
[311,0,311]
[312,0,312]
[313,0,313]
[314,0,314]
[315,0,315]
[316,0,316]
[317,0,317]
[318,0,318]
[319,0,319]
[320,0,320]
[{"$f":"C324","v":321},0,321]
[322,0,322]
[323,0,{"$f":"+C325+1","v":323}]
[324,0,324]
[325,0,325]
[326,0,326]
[327,0,327]
[328,0,328]
[329,0,329]
[330,0,330]
[331,0,331]
[332,0,332]
[333,0,333]
[334,0,334]
[335,0,335]
[336,0,336]
[337,0,337]
[338,0,338]
[339,0,339]
[340,0,340]
[341,0,341]
[342,0,342]
[343,0,343]
[344,0,344]
[345,0,345]
[346,0,346]
[347,0,347]
[348,0,348]
[349,0,349]
[350,0,350]
[351,0,351]
[352,0,352]
[353,0,353]
[354,0,354]
[355,0,355]
[356,0,356]
[357,0,357]
[358,0,358]
[359,0,359]
[360,0,360]
[361,{"$f":"VLOOKUP(A364,$C$4:$V$10001,1+$A$1)","v":0},361]
[362,0,362]
[363,0,363]
[364,0,364]
[365,0,365]
[366,0,366]
[367,0,367]
[368,0,368]
[369,0,369]
[370,0,370]
[371,0,371]
[372,0,372]
[373,0,373]
[374,0,374]
[375,0,375]
[376,0,376]
[377,0,377]
[378,0,378]
[379,0,379]
[380,0,380]
[381,0,381]
[382,0,382]
[383,0,383]
[384,0,384]
[{"$f":"C388","v":385},0,385]
[386,0,386]
[387,0,{"$f":"+C389+1","v":387}]
[388,0,388]
[389,0,389]
[390,0,390]
[391,0,391]
[392,0,392]
[393,0,393]
[394,0,394]
[395,0,395]
[396,0,396]
[397,0,397]
[398,0,398]
[399,0,399]
[400,0,400]
[401,0,401]
[402,0,402]
[403,0,403]
[404,0,404]
[405,0,405]
[406,0,406]
[407,0,407]
[408,0,408]
[409,0,409]
[410,0,410]
[411,0,411]
[412,0,412]
[413,0,413]
[414,0,414]
[415,0,415]
[416,0,416]
[417,0,417]
[418,0,418]
[419,0,419]
[420,0,420]
[421,0,421]
[422,0,422]
[423,0,423]
[424,0,424]
[425,{"$f":"VLOOKUP(A428,$C$4:$V$10001,1+$A$1)","v":0},425]
[426,0,426]
[427,0,427]
[428,0,428]
[429,0,429]
[430,0,430]
[431,0,431]
[432,0,432]
[433,0,433]
[434,0,434]
[435,0,435]
[436,0,436]
[437,0,437]
[438,0,438]
[439,0,439]
[440,0,440]
[441,0,441]
[442,0,442]
[443,0,443]
[444,0,444]
[445,0,445]
[446,0,446]
[447,0,447]
[448,0,448]
[{"$f":"C452","v":449},0,449]
[450,0,450]
[451,0,{"$f":"+C453+1","v":451}]
[452,0,452]
[453,0,453]
[454,0,454]
[455,0,455]
[456,0,456]
[457,0,457]
[458,0,458]
[459,0,459]
[460,0,460]
[461,0,461]
[462,0,462]
[463,0,463]
[464,0,464]
[465,0,465]
[466,0,466]
[467,0,467]
[468,0,468]
[469,0,469]
[470,0,470]
[471,0,471]
[472,0,472]
[473,0,473]
[474,0,474]
[475,0,475]
[476,0,476]
[477,0,477]
[478,0,478]
[479,0,479]
[480,0,480]
[481,0,481]
[482,0,482]
[483,0,483]
[484,0,484]
[485,0,485]
[486,0,486]
[487,0,487]
[488,0,488]
[489,{"$f":"VLOOKUP(A492,$C$4:$V$10001,1+$A$1)","v":0},489]
[490,0,490]
[491,0,491]
[492,0,492]
[493,0,493]
[494,0,494]
[495,0,495]
[496,0,496]
[497,0,497]
[498,0,498]
[499,0,499]
[500,0,500]
[501,0,501]
[502,0,502]
[503,0,503]
[504,0,504]
[505,0,505]
[506,0,506]
[507,0,507]
[508,0,508]
[509,0,509]
[510,0,510]
[511,0,511]
[512,0,512]
[{"$f":"C516","v":513},0,513]
[514,0,514]
[515,0,{"$f":"+C517+1","v":515}]
[516,0,516]
[517,0,517]
[518,0,518]
[519,0,519]
[520,0,520]
[521,0,521]
[522,0,522]
[523,0,523]
[524,0,524]
[525,0,525]
[526,0,526]
[527,0,527]
[528,0,528]
[529,0,529]
[530,0,530]
[531,0,531]
[532,0,532]
[533,0,533]
[534,0,534]
[535,0,535]
[536,0,536]
[537,0,537]
[538,0,538]
[539,0,539]
[540,0,540]
[541,0,541]
[542,0,542]
[543,0,543]
[544,0,544]
[545,0,545]
[546,0,546]
[547,0,547]
[548,0,548]
[549,0,549]
[550,0,550]
[551,0,551]
[552,0,552]
[553,{"$f":"VLOOKUP(A556,$C$4:$V$10001,1+$A$1)","v":0},553]
[554,0,554]
[555,0,555]
[556,0,556]
[557,0,557]
[558,0,558]
[559,0,559]
[560,0,560]
[561,0,561]
[562,0,562]
[563,0,563]
[564,0,564]
[565,0,565]
[566,0,566]
[567,0,567]
[568,0,568]
[569,0,569]
[570,0,570]
[571,0,571]
[572,0,572]
[573,0,573]
[574,0,574]
[575,0,575]
[576,0,576]
[{"$f":"C580","v":577},0,577]
[578,0,578]
[579,0,{"$f":"+C581+1","v":579}]
[580,0,580]
[581,0,581]
[582,0,582]
[null,{"$error":"#N/A"}]
[null,{"$error":"#N/A"}]
[null,{"$error":"#N/A"}]
[null,{"$error":"#N/A"}]
[null,{"$error":"#N/A"}]
[null,{"$error":"#N/A"}]
[null,{"$error":"#N/A"}]
[null,{"$error":"#N/A"}]
[null,{"$error":"#N/A"}]
[null,{"$error":"#N/A"}]
[null,{"$error":"#N/A"}]
[null,{"$error":"#N/A"}]

{"sheet":"Tags","index":18,"n_rows":614,"n_cols":9,"rows_kept":614,"cut":false,"hidden":true,"merged":[]}
[{"$f":"'Languages Available'!B1","v":1},"Language Selected",null,{"$f":"'General Info'!E3","v":"English"}]
[null,null,null,1,2,3,4,5,6]
[null,"Active Language",null,{"$f":"VLOOKUP(D2,'Languages Available'!$A$3:$B$23,2)","v":"English"},{"$f":"VLOOKUP(E2,'Languages Available'!$A$3:$B$23,2)","v":"Dutch"},{"$f":"VLOOKUP(F2,'Languages Available'!$A$3:$B$23,2)","v":"Français"},{"$f":"VLOOKUP(G2,'Languages Available'!$A$3:$B$23,2)","v":"Deutsch"},{"$f":"VLOOKUP(H2,'Languages Available'!$A$3:$B$23,2)","v":"Spanish"},{"$f":"VLOOKUP(I2,'Languages Available'!$A$3:$B$23,2)","v":"Portuguese"}]
[{"$f":"C4","v":1},{"$f":"IF(ISBLANK(VLOOKUP(A4,$C$4:$V$10002,1+$A$1)),D4,VLOOKUP(A4,$C$4:$V$10002,1+$A$1))","v":"Date"},1,"Date","Datum","Date","Datum","Fecha","Data"]
[2,"Language",2,"Language","Taal","Langue","Sprache","Idioma","Língua"]
[3,"Country",3,"Country","Land","Pays","Land","País","País"]
[4,"Name of Car Park",4,"Name of Car Park","Naam van de garage","Nom du parking","Name des Parkhauses","Nombre del aparcamiento","Nome do Parque"]
[5,"Address",5,"Address","Adres","Adresse","Adresse","Dirección","Morada"]
[6,"City",6,"City","Stad","Ville","Stadt","Ciudad","Localidade"]
[7,"Number of Spaces",7,"Number of Spaces","Aantal parkeerplaatsen","Nombre de places de stationnement","Anzahl der Stellplätze","Número de plazas","Número de Lugares"]
[8,"Operator",8,"Operator","Exploitant","Exploitant","Betreiber","Operador","Operador"]
[9,"Contact Name",9,"Contact Name","Contactpersoon","Personne de contact","Kontaktperson","Persona de contacto","Pessoa a contatar"]
[10,"e-Mail",10,"e-Mail","e-mail","e-mail","e-Mail","Correo electrónico","E-mail"]
[11,"Phone",11,"Phone","Telefoon nummer","Téléphone","Telefon","Teléfono","Telefone"]
[12,"Judged by",12,"Judged by","Beoordeeld door:","Evalué par","Geprüft von","Valorado por","Verificado por"]
[13,"Evaluation Conditions",13,"Evaluation Conditions","Condities tijdens de beoordeling","Conditions de l’évaluation","Prüfbedingungen","Condiciones de la valoración","Condições de Avaliação"]
[14,"Time of Day",14,"Time of Day","tijdstip","Moment de la journée","Tageszeit","Hora del día","Periodo do dia"]
[15,"Weather Conditions",15,"Weather Conditions","Weersomstandigheden","Conditions météo","Wetterbedingungen","Condiciones climáticas","Condições Meteorológicas"]
[16,"Occupancy Rate",16,"Occupancy Rate","Bezetting van de garage","Taux d’occupation","Auslastung","Ratio de ocupación","Taxa de ocupação"]
[17,"Completed",17,"Completed","Gereed","Complet","vollständig","Completo","Completo"]
[{"$f":"C21","v":18},"Incompleted",18,"Incompleted","Nog niet gereed","Incomplet","unvollständig","Incompleto","Incompleto"]
[19,"Compliant",19,"Compliant","Accoord","Conforme","übereinstimmend","Conforme","Conforme"]
[20,"Comments",20,"Comments","Commentaar","Commentaires","Kommentare","Comentarios","Comentários"]
[21,"Number of Ok:",21,"Number of Ok:","Aantal accoord","Nombre de OK","Anzahl von Übereinstimmungen","Número de OK:","Número de Ok:"]
[22,"Number of Fails:",22,"Number of Fails:","Aantal niet accoord","Nombre de NOK","Anzahl von Mängeln","Número de fallos:","Número de Falhas:"]
[23,"Not Evaluated:",23,"Not Evaluated:","Niet ingevuld","Non évalué","nicht überprüft","No evaluado","Não avaliado:"]
[24,"Pass",24,"Pass","Accoord","Accepté","bestanden","Aprobado","Aprovado"]
[25,"Fail",25,"Fail","Niet accoord","Refusé","nicht bestanden","Suspendido","Reprovado"]
[26,"Incomplete",26,"Incomplete","Niet compleet","Incomplet","unvollständig","Incompleto","Incompleto"]
[27,"Total Items",27,"Total Items","Totaal items","Nombre de sections","Summe der Positionen","Total elementos","Total Items"]
[28,"Total Items + SubItems",28,"Total Items + SubItems","Totaal incl sub-items","Nombre de sections et sous-sections","Summe der Positionen und Unterpositionen","Total elementos + sub-elementos","Total Items + Subitems"]
[29,"Itens Completed",29,"Itens Completed","Items ingevuld","Nombre de sections complètes","vollständige Positionen","Elementos completados","Itens Completos"]
[30,"Not measured",30,"Not measured","Niet ingevuld","Nombre de sections non évaluées","nicht gemessen","No medido","Não medido"]
[31,"Score",31,"Score","Score","Score","Punktzahl","Puntuación","Pontuação atribuída"]
[32,"Maximum Score",32,"Maximum Score","Maximun score","Score maximum","Maximale Punktzahl","Puntuación máxima","Pontuação Máxima"]
[33,"Percentage",33,"Percentage","% Score","Pourcentage","Prozentsatz","Porcentaje","Percentagem"]
[34,"Category Value",34,"Category Value","Categorie gewichtsfactor","Pondération de la section","Wert der Kategorie","Valor de la categoría","Valor da Categoria"]
[35,"Global Evaluation",35,"Global Evaluation","Score overzicht","Evaluation globale","Gesamtbewertung","Evaluación global","Avaliação Global"]
[36,"Category",36,"Category","Categorie","Catégorie","Kategorie","Categoría","Categoria"]
[37,"Number of Items",37,"Number of Items","Aantal items","Nombre de sections","Anzahl der Positionen","Número de elementos","Número de itens"]
[38,"Number of Oks",38,"Number of Oks","Aantal accoord","Nombre de OK","Anzahl der Übereinstimmungen","Número de OK:","Número de Oks"]
[39,"Number of Fails",39,"Number of Fails","Aantal niet accoord","Nombre de NOK","Anzahl der Mängel","Número de fallos:","Número de Falhas"]
[40,"To be Completed",40,"To be Completed","Nog in te vullen","A compléter","zu vervollständigen","A rellenar","Para ser concluído"]
[41,"% Obtained",41,"% Obtained","% score","% obtenu","% erreicht","% obtenido","% Obtida"]
[42,"Minimum",42,"Minimum","Minimum vereiste","Minimum","Minimum","Mínimo","Mínimo"]
[43,"Category Points",43,"Category Points","Categorie gewichtsfactor","Pondération ","Punktzahl der Kategorie","Puntos de la categoría","Categoria de Pontos"]
[44,"Points Obtained",44,"Points Obtained","Score punten","Résultats","erreichte Punktzahl","Puntos obtenidos","Pontos Obtidos"]
[45,"Status",45,"Status","Status","Statut","Status","Estado","Estado"]
[46,"% Completion:",46,"% Completion:","% ingevuld","% nombre réponse requise","% Vollständigkeit","% ejecución","% Completa:"]
[47,"Subtotals",47,"Subtotals","Subtotaal","Sous-total","Zwischensummen","Subtotales","Subtotal"]
[48,"Totals",48,"Totals","Totaal","Total","Summen","Totales","Total"]
[49,"Minimum Requirement for ESPA Award",49,"Minimum Requirement for ESPA Award","Minimum vereiste voor ESPA award","Condition minimum pour obtention ESPA","Mindestanforderung für ESPA Award","Requisito mínimo para premio ESPA","Mínimo requerido para Prémio ESPA"]
[50,"Categories Minimum Points",50,"Categories Minimum Points","Minimum vereiste  punten per categorie behaald","Sections résultat minimum atteints","Mindestpunktzahl dieser Kategorie","Puntuación mínima de las categorías","Patamares Mínimos em Todas as Categorias"]
[51,"Espa Award",51,"Espa Award","Espa Award","Label ESPA","ESPA Award","Premio ESPA","Prémio ESPA"]
[52,"Item List",52,"Item List","Item List","Liste des sections","Positionsliste","Lista de elementos","Lista de Itens"]
[53,"Measured value",53,"Measured value","Resultaat meting","Résultats mesurés","Messwerte","Valor medido","Valor Medido"]
[54,"Maximum Contribuition for Final Score",54,"Maximum Contribuition for Final Score","Maximum bijdrage eindscore","Contribution maximale résultat final","maximaler Beitrag zum Endergebnis","Contribución máxima a la puntuación final","Contribuição Máxima para Pontuação Final"]
[55,"Contribuition for Final Score",55,"Contribuition for Final Score","Bijdrage voor eindscore","Contribution résultat final","Beitrag zum Endergebnis","Contribución a la puntuación final","Contribuição para a Pontuação Final"]
[56,"Remarks",56,"Remarks","Opmerkingen","Remarques","Anmerkungen","Comentarios","Observações"]
[57,"Notes",57,"Notes","Reacties","Commentaires","Anmerkungen","Notas","Notas"]
[58,"This will erase all data in ESPA Worksheet. Are you sure?",58,"This will erase all data in ESPA Worksheet. Are you sure?","Dit zal alle bestaande data in het spreadsheet verwijderen. Wilt U dat?",null,"Dies wird alle Daten in dem ESPA Arbeitsblatt löschen. Sind Sie sicher?","Se borrarán todos los datos de la hoja de cálculo ESPA. Desea continuar?","Isto irá apagar todos os dados na Folha de Trabalho ESPA. Tem a certeza?"]
[59,"You have entered an incorrect password. ESPA Worksheets could not be umprotected.",59,"You have entered an incorrect password. ESPA Worksheets could not be umprotected.","U heeft een ongeldig wachtwoord ingevoerd, beveiliging kan niet worden opgeheven",null,"Sie haben ein unzulässiges Passwort eingegeben. Die ESPA Arbeitsblätter können nicht ungeschützt bleiben.","La constraseña introducida es incorrecta. No se ha podido desproteger la hoja de cálculo.","Introduziu uma password incorreta. A Folha de Trabalho ESPA não pode ser desprotegida. "]
[60,"Please enter your password to umprotect ESPA Worksheet:",60,"Please enter your password to umprotect ESPA Worksheet:","Voer Uw wachtwoord in om de beveiliging van het spreadsheet op te heffen",null,"Bitte geben Sie Ihr Passwort ein um das ESPA Arbeitsblatt zu öffnen.","Introduzca la contraseña para desproteger la hoja de cálculo ESPA:","Por favor introduza a password para desproteger a Folha de Trabalho ESPA"]
[61,"Password Input",61,"Password Input","Invoer wachtwoord",null,"Eingabe Passwort","Introduzca la contraseña","Senha de entrada"]
[62,"Incorrect Password",62,"Incorrect Password","Onjuist wachtwoord",null,"Unzulässiges Passwort","Contraseña incorrecta","Password incorreta"]
[63,"This will print 15 pages on your active printer. Are you sure?",63,"This will print 15 pages on your active printer. Are you sure?","Dit commando leidt tot 15 afdrukpagina's op de actieve printer. Wilt U dat?",null,"Hierdurch werden 14 Seiten auf Ihrem aktiven Drucker ausgedruckt. Sind Sie sicher?","Se imprimirán 15 páginas en su inmpresora activa. Desea continuar?","Irá imprimir 15 páginas na sua impressora ativa. Tem a certeza?"]
[64,"Alert",64,"Alert","Let op! ",null,"Alarm","Alerta","Aviso"]
[65,{"$f":"IF(ISBLANK(VLOOKUP(A68,$C$4:$V$10002,1+$A$1)),D68,VLOOKUP(A68,$C$4:$V$10002,1+$A$1))","v":"Changing languge will reset al your previous answers. Do you want to proceed?"},65,"Changing languge will reset al your previous answers. Do you want to proceed?","Wijziging van de taal zal alle reeds gegeven antwoorden verwijderen. Wilt U doorgaan?",null,"Das Ändern der Sprache wird alle Ihre bisherigen Eingaben zurücksetzen. Sind Sie sicher?","El cambio de idioma eliminará sus respuestas anteriores. Desea continuar?","Alterar o idioma apaga todas as respostas anteriores. Deseja continuar?"]
[66,"Mandatory Conditions for Golden Award",66,"Mandatory Conditions for Golden Award","Verplichte minimumeisen voor gold award",null,"Mindestbedingungen für den Gold Award","Condiciones obligatorias para premio Oro","Condições Obrigatórias para ESPA Dourado"]
[67,"ESPA Gold Award",67,"ESPA Gold Award","ESPA Gold Award",null,"ESPA Gold Award","Permio Oro ESPA","Prémio ESPA Dourado"]
[68,"Global Evaluation - Gold Award",68,"Global Evaluation - Gold Award","Algemene waardering, gold award",null,"Globale Bewertung - Gold Award","Evaluación global - Premio Oro","Avaliação Global - Prémio Dourado"]
[69,"The ESPA Worksheet uses Macros. Please enable content or close and reopen with Macros Enabled",69,"The ESPA Worksheet uses Macros. Please enable content or close and reopen with Macros Enabled","Het ESPA werkblad gebruikt makro's, sluit het bestand en heropen met \"makro's mogelijk\"",null,"Das ESPA Arbeitsblatt verwendet Macros. Bitte das Arbeitsblatt schließen, Macros zulassen und neu anschließend erneut öffnen.","La hoja de cálculo ESPA utiliza Macros. Cierre el archivo y vuelva a abrirlo con la opción Macros activadas.","A folha de cálculo ESPA utiliza Macros. Por favor feche e volte a abrir o ficheiro com a opção Macros activada."]
[70,"Year of Construction",70,"Year of Construction","Bouwjaar",null,"Baujahr","Año de Construción","Ano de Construção"]
[71,"Structure",71,"Structure","Gebouw",null,"Bauart",null,"Estrutura"]
[72,"Type",72,"Type","Type",null,"Typ",null,"Tipo"]
[73,"Access Control System",73,"Access Control System","Toegangscontrole",null,"Zutrittskontrolle",null,"Sistema de Controle de Acessos"]
[74,"Number of Lifts",74,"Number of Lifts","Aantal liften",null,"Anzahl Fahrstühle",null,"Número de Elevadores"]
[75,"Number of Floors",75,"Number of Floors","Aantal verdiepingen",null,"Anzahl Ebenen",null,"Número de Pisos"]
[76,"Car Park Main Characteristics",76,"Car Park Main Characteristics","Hoofdkenmerken van de garage",null,"Stammdaten Einrichtung",null,"Caracteristicas Principais"]
[77,0,77]
[78,0,78]
[79,0,79]
[80,0,80]
[81,0,81]
[{"$f":"C85","v":82},0,82]
[83,0,83]
[84,0,84]
[85,0,85]
[86,0,86]
[87,0,87]
[88,0,88]
[89,0,89]
[90,0,90]
[91,0,91]
[92,0,92]
[93,0,93]
[94,0,94]
[95,0,95]
[96,0,96]
[97,0,97]
[98,0,98]
[99,0,99]
[100,0,100]
[101,0,101]
[102,0,102]
[103,0,103]
[104,0,104]
[105,0,105]
[106,0,106]
[107,0,107]
[108,0,108]
[109,0,109]
[110,0,110]
[111,0,111]
[112,0,112]
[113,0,113]
[114,0,114]
[115,0,115]
[116,0,116]
[117,0,117]
[118,0,118]
[119,0,119]
[120,0,120]
[121,0,121]
[122,0,122]
[123,0,123]
[124,0,124]
[125,0,125]
[126,0,126]
[127,0,127]
[128,0,128]
[129,{"$f":"IF(ISBLANK(VLOOKUP(A132,$C$4:$V$10002,1+$A$1)),D132,VLOOKUP(A132,$C$4:$V$10002,1+$A$1))","v":0},129]
[130,0,130]
[131,0,131]
[132,0,132]
[133,0,133]
[134,0,134]
[135,0,135]
[136,0,136]
[137,0,137]
[138,0,138]
[139,0,139]
[140,0,140]
[141,0,141]
[142,0,142]
[143,0,143]
[144,0,144]
[145,0,145]
[{"$f":"C149","v":146},0,146]
[147,0,147]
[148,0,148]
[149,0,149]
[]
[]
[]
[]
[]
[]
[]
[]
[]
[]
[]
[]
[]
[]
[]
[]
[]
[]
[]
[]
[]
[]
[]
[]
[]
[]
[]
[]
[]
[]
[]
[]
[]
[]
[]
[]
[]
[]
[]
[]
[]
[]
[]
[]
[]
[]
[]
[]
[]
[]
[]
[]
[]
[]
[]
[]
[]
[]
[]
[]
[]
[]
[]
[]
[]
[]
[]
[]
[]
[]
[]
[]
[]
[]
[]
[]
[]
[]
[]
[]
[]
[]
[]
[]
[]
[]
[]
[]
[]
[]
[]
[]
[]
[]
[]
[]
[]
[]
[]
[]
[]
[]
[]
[]
[]
[]
[]
[]
[]
[]
[]
[]
[]
[]
[]
[]
[]
[]
[]
[]
[]
[]
[]
[]
[]
[]
[]
[]
[]
[]
[]
[]
[]
[]
[]
[]
[]
[]
[]
[]
[]
[]
[]
[]
[]
[]
[]
[]
[]
[]
[]
[]
[]
[]
[]
[]
[]
[]
[]
[]
[]
[]
[]
[]
[]
[]
[]
[]
[]
[]
[]
[]
[]
[]
[]
[]
[]
[]
[]
[]
[]
[]
[]
[]
[]
[]
[]
[]
[]
[]
[]
[]
[]
[]
[]
[]
[]
[]
[]
[]
[]
[]
[]
[]
[]
[]
[]
[]
[]
[]
[]
[]
[]
[]
[]
[]
[]
[]
[]
[]
[]
[]
[]
[]
[]
[]
[]
[]
[]
[]
[]
[]
[]
[]
[]
[]
[]
[]
[]
[]
[]
[]
[]
[]
[]
[]
[]
[]
[]
[]
[]
[]
[]
[]
[]
[]
[]
[]
[]
[]
[]
[]
[]
[]
[]
[]
[]
[]
[]
[]
[]
[]
[]
[]
[]
[]
[]
[]
[]
[]
[]
[]
[]
[]
[]
[]
[]
[]
[]
[]
[]
[]
[]
[]
[]
[]
[]
[]
[]
[]
[]
[]
[]
[]
[]
[]
[]
[]
[]
[]
[]
[]
[]
[]
[]
[]
[]
[]
[]
[]
[]
[]
[]
[]
[]
[]
[]
[]
[]
[]
[]
[]
[]
[]
[]
[]
[]
[]
[]
[]
[]
[]
[]
[]
[]
[]
[]
[]
[]
[]
[]
[]
[]
[]
[]
[]
[]
[]
[]
[]
[]
[]
[]
[]
[]
[]
[]
[]
[]
[]
[]
[]
[]
[]
[]
[]
[]
[]
[]
[]
[]
[]
[]
[]
[]
[]
[]
[]
[]
[]
[]
[]
[]
[]
[]
[]
[]
[]
[]
[]
[]
[]
[]
[]
[]
[]
[]
[]
[]
[]
[]
[]
[]
[]
[]
[]
[]
[]
[]
[]
[]
[]
[]
[]
[]
[]
[]
[]
[]
[]
[]
[]
[]
[]
[]
[]
[]
[]
[]
[]
[]
[]
[]
[]
[]
[]
[]
[]
[]
[]
[null,{"$f":"VLOOKUP(A603,$C$20:$V$10018,1+$A$1)","v":{"$error":"#N/A"}}]
[null,{"$error":"#N/A"}]
[null,{"$error":"#N/A"}]
[null,{"$error":"#N/A"}]
[null,{"$error":"#N/A"}]
[null,{"$error":"#N/A"}]
[null,{"$error":"#N/A"}]
[null,{"$error":"#N/A"}]
[null,{"$error":"#N/A"}]
[null,{"$error":"#N/A"}]
[null,{"$error":"#N/A"}]
[null,{"$error":"#N/A"}]

{"sheet":"Help","index":19,"n_rows":5,"n_cols":7,"rows_kept":5,"cut":false,"hidden":true,"merged":[]}
[{"$f":"'Languages Available'!B1","v":1},"Language Selected",null,{"$f":"'General Info'!E3","v":"English"}]
[null,null,null,1,2,3,4]
[null,"Active Language",null,{"$f":"VLOOKUP(D2,'Languages Available'!$A$3:$B$23,2)","v":"English"},{"$f":"VLOOKUP(E2,'Languages Available'!$A$3:$B$23,2)","v":"Dutch"},{"$f":"VLOOKUP(F2,'Languages Available'!$A$3:$B$23,2)","v":"Français"},{"$f":"VLOOKUP(G2,'Languages Available'!$A$3:$B$23,2)","v":"Deutsch"}]
[{"$f":"C4","v":1},{"$f":"VLOOKUP(A4,$C$3:$AZ$199,1+Languages!$A$1)","v":"God save the queen\rSuspendisse hendrerit ligula eget odio. Sed erat nisi, rhoncus id, imperdiet quis, blandit et, felis. In at nulla mattis neque commodo venenatis. Cras ultrices tincidunt risus. Quisque dictum diam adipiscing arcu. In diam turpis, suscipit fringilla, dapibus quis, dictum ut, ipsum. Phasellus id elit in dui bibendum bibendum.\rUt metus diam, lacinia ut, tincidunt eu, dapibus sit amet, mauris. Donec varius, felis eget lobortis vehicula, magna sapien elementum tellus, ut iaculis dui orci sed arcu. Nam nibh erat, auctor sit amet, commodo ut, ornare id, ante. In imperdiet, justo id eleifend faucibus, urna dolor consectetuer dui, vel pretium risus purus sed pede.Etiam rutrum libero posuere libero."},1,"God save the queen\nSuspendisse hendrerit ligula eget odio. Sed erat nisi, rhoncus id, imperdiet quis, blandit et, felis. In at nulla mattis neque commodo venenatis. Cras ultrices tincidunt risus. Quisque dictum diam adipiscing arcu. In diam turpis, suscipit fringilla, dapibus quis, dictum ut, ipsum. Phasellus id elit in dui bibendum bibendum.\nUt metus diam, lacinia ut, tincidunt eu, dapibus sit amet, mauris. Donec varius, felis eget lobortis vehicula, magna sapien elementum tellus, ut iaculis dui orci sed arcu. Nam nibh erat, auctor sit amet, commodo ut, ornare id, ante. In imperdiet, justo id eleifend faucibus, urna dolor consectetuer dui, vel pretium risus purus sed pede.Etiam rutrum libero posuere libero.","Amsterdam Philips Shell\nSuspendisse hendrerit ligula eget odio. Sed erat nisi, rhoncus id, imperdiet quis, blandit et, felis. In at nulla mattis neque commodo venenatis. Cras ultrices tincidunt risus. Quisque dictum diam adipiscing arcu. In diam turpis, suscipit fringilla, dapibus quis, dictum ut, ipsum. Phasellus id elit in dui bibendum bibendum.\nUt metus diam, lacinia ut, tincidunt eu, dapibus sit amet, mauris. Donec varius, felis eget lobortis vehicula, magna sapien elementum tellus, ut iaculis dui orci sed arcu. Nam nibh erat, auctor sit amet, commodo ut, ornare id, ante. In imperdiet, justo id eleifend faucibus, urna dolor consectetuer dui, vel pretium risus purus sed pede.Etiam rutrum libero posuere libero.","Alons enfants de patrie\nSuspendisse hendrerit ligula eget odio. Sed erat nisi, rhoncus id, imperdiet quis, blandit et, felis. In at nulla mattis neque commodo venenatis. Cras ultrices tincidunt risus. Quisque dictum diam adipiscing arcu. In diam turpis, suscipit fringilla, dapibus quis, dictum ut, ipsum. Phasellus id elit in dui bibendum bibendum.\nUt metus diam, lacinia ut, tincidunt eu, dapibus sit amet, mauris. Donec varius, felis eget lobortis vehicula, magna sapien elementum tellus, ut iaculis dui orci sed arcu. Nam nibh erat, auctor sit amet, commodo ut, ornare id, ante. In imperdiet, justo id eleifend faucibus, urna dolor consectetuer dui, vel pretium risus purus sed pede.Etiam rutrum libero posuere libero.","Ich bin ein berliner\nSuspendisse hendrerit ligula eget odio. Sed erat nisi, rhoncus id, imperdiet quis, blandit et, felis. In at nulla mattis neque commodo venenatis. Cras ultrices tincidunt risus. Quisque dictum diam adipiscing arcu. In diam turpis, suscipit fringilla, dapibus quis, dictum ut, ipsum. Phasellus id elit in dui bibendum bibendum.\nUt metus diam, lacinia ut, tincidunt eu, dapibus sit amet, mauris. Donec varius, felis eget lobortis vehicula, magna sapien elementum tellus, ut iaculis dui orci sed arcu. Nam nibh erat, auctor sit amet, commodo ut, ornare id, ante. In imperdiet, justo id eleifend faucibus, urna dolor consectetuer dui, vel pretium risus purus sed pede.Etiam rutrum libero posuere libero."]
[2,{"$f":"VLOOKUP(A5,$C$3:$AZ$199,1+Languages!$A$1)","v":"Help in English"},2,"Help in English","Help in Dutch","Help in Dutch","Help in Deutsch"]

{"sheet":"Languages Available","index":20,"n_rows":8,"n_cols":8,"rows_kept":8,"cut":false,"hidden":true,"merged":[]}
["Language List",{"$f":"SUM(C3:C43)","v":1},{"$f":"'General Info'!E3","v":"English"},{"$f":"SUM(E3:E8)","v":0},{"$f":"VLOOKUP(D1,A3:B12,2)","v":{"$error":"#N/A"}}]
[null,null,null,null,null,null,"pw","espa2014"]
[1,"English",{"$f":"IF(B3=$C$1,A3,0)","v":1},null,{"$f":"IF(Translations!$C$1='Languages Available'!B3,A3,0)","v":0}]
[2,"Dutch",{"$f":"IF(B4=$C$1,A4,0)","v":0},null,{"$f":"IF(Translations!$C$1='Languages Available'!B4,A4,0)","v":0}]
[3,"Français",{"$f":"IF(B5=$C$1,A5,0)","v":0},null,{"$f":"IF(Translations!$C$1='Languages Available'!B5,A5,0)","v":0}]
[4,"Deutsch",{"$f":"IF(B6=$C$1,A6,0)","v":0},null,{"$f":"IF(Translations!$C$1='Languages Available'!B6,A6,0)","v":0}]
[5,"Spanish",{"$f":"IF(B7=$C$1,A7,0)","v":0},null,{"$f":"IF(Translations!$C$1='Languages Available'!B7,A7,0)","v":0}]
[6,"Portuguese",0,null,{"$f":"IF(Translations!$C$1='Languages Available'!B8,A8,0)","v":0}]

{"sheet":"Aux","index":21,"n_rows":26,"n_cols":12,"rows_kept":26,"cut":false,"hidden":true,"merged":[]}
["Tabelas Auxiliares",null,null,null,"Tabela de Worksheets",null,null,null,null,null,null,"Available Countries"]
[]
["Configurações",null,null,null,1]
[null,null,null,null,2]
["Sistema",{"$f":"win_or_mac()","v":"mac"},null,null,3]
["Versão",{"$f":"excel_version()","v":"15.24"},null,null,4]
[null,null,null,null,5]
["Default email system",null,{"$f":"IF(B5=\"mac\",DefaultMailProgram(),\"windows send mail\")","v":"com.apple.mail"},null,6]
[null,null,null,null,7]
[null,null,null,null,8]
[null,null,null,null,9]
[null,null,null,null,10]
[null,null,null,null,11]
[null,null,null,null,12]
[null,null,null,null,13]
[null,null,null,null,14]
[null,null,null,null,15]
["A fazer:",null,null,null,16]
[null,null,null,null,17]
["Help System",null,null,null,18]
["Splash Screen",null,null,null,19]
["Configuração Inicial do Parque",null,null,null,20]
["Gold Award",null,null,null,21]
[null,null,null,null,22]
["Sistema de entradas e saídas.",null,null,null,23]
["Mover tabela auxiliar para a página certa",null,null,null,24]

{"sheet":"Translations","index":22,"n_rows":585,"n_cols":3,"rows_kept":585,"cut":false,"hidden":false,"merged":[]}
[null,"from English to:"]
[]
[null,"Text","Text"]
[1,"Mandatory Minimum Conditions",{"$f":"VLOOKUP(A4,Languages!$C$4:$I$273,1+'Languages Available'!$D$1)","v":1}]
[{"$f":"A4+1","v":2},"Car park must be for public use",{"$f":"VLOOKUP(A5,Languages!$C$4:$I$273,1+'Languages Available'!$D$1)","v":2}]
[{"$f":"A5+1","v":3},"Minimum headroom = 1.90 m, generally in the public areas. Incidental lower obstacles must be clearly marked.",{"$f":"VLOOKUP(A6,Languages!$C$4:$I$273,1+'Languages Available'!$D$1)","v":3}]
[4,"Minimum headroom = 2,00 m, generally in the public areas. Incidental lower obstacles must be clearly marked.",{"$f":"VLOOKUP(A7,Languages!$C$4:$I$273,1+'Languages Available'!$D$1)","v":4}]
[5,"There must be at least one dedicated entry and exit lane although additional tidal flow lanes are allowed.",{"$f":"VLOOKUP(A8,Languages!$C$4:$I$273,1+'Languages Available'!$D$1)","v":5}]
[6,"70% of bays must be at least 2.30m wide. For renovated car parks, over ten years old, minimum bay width of 2.25m is allowed (in that case a penalty applies - check M8).",{"$f":"VLOOKUP(A9,Languages!$C$4:$I$273,1+'Languages Available'!$D$1)","v":6}]
[7,"70% of bays must be at least 2.40m wide.",{"$f":"VLOOKUP(A10,Languages!$C$4:$I$273,1+'Languages Available'!$D$1)","v":7}]
[8,"All straight ramps for  unidirectional traffic must be minimum 2.7 metres wide. Bidirectional ramps must be at least 6m wide with lane markings. Ramp width is measured between walls or pillars",{"$f":"VLOOKUP(A11,Languages!$C$4:$I$273,1+'Languages Available'!$D$1)","v":8}]
[9,"Curved ramps for single directional traffic must have an external radius of minimum 8.00 metres with lane width of minimum 3.5 metres. For bidirectional curved ramps this applies for the inner driving lane. The outside driving lane must be minimum 3.5 metres wide as well. ",{"$f":"VLOOKUP(A12,Languages!$C$4:$I$273,1+'Languages Available'!$D$1)","v":9}]
[10,"Ramp gradients must not exceed 20% , to be measured at the middle of driving lane.  At bidirectional curved ramps this applies for the inner (steepest) driving lane.",{"$f":"VLOOKUP(A13,Languages!$C$4:$I$273,1+'Languages Available'!$D$1)","v":10}]
[11,"If the car park has paid parking and access control by barriers or gates, staff must be contactable at the pay point/exit point and secured pedestrian entries.",{"$f":"VLOOKUP(A14,Languages!$C$4:$I$273,1+'Languages Available'!$D$1)","v":11}]
[12,"Receipt for payment must be provided when requested.",{"$f":"VLOOKUP(A15,Languages!$C$4:$I$273,1+'Languages Available'!$D$1)","v":12}]
[13,"All turning movements must be capable of being completed without reversing (moving in/out the parking bay and cul-de-sacs excluded)",{"$f":"VLOOKUP(A16,Languages!$C$4:$I$273,1+'Languages Available'!$D$1)","v":13}]
[14,"Average light levels on parking area at floor is at minimum 20 Lux",{"$f":"VLOOKUP(A17,Languages!$C$4:$I$273,1+'Languages Available'!$D$1)","v":14}]
[15,"Average light levels on parking area at floor is at minimum 50 Lux",{"$f":"VLOOKUP(A18,Languages!$C$4:$I$273,1+'Languages Available'!$D$1)","v":15}]
[16,"Lighting",{"$f":"VLOOKUP(A19,Languages!$C$4:$I$273,1+'Languages Available'!$D$1)","v":16}]
[17,"Item List (values in Lux, see user manual for measurement)",{"$f":"VLOOKUP(A20,Languages!$C$4:$I$273,1+'Languages Available'!$D$1)","v":17}]
[18,"Vehicular entry area; at floor level\n•  Above 200 Lux = 5;\n•  Between 75– 200 Lux: 0,04 pt per Lux over 75  \n•  Below 75 Lux = 0",{"$f":"VLOOKUP(A21,Languages!$C$4:$I$273,1+'Languages Available'!$D$1)","v":18}]
[19,"Entry; at 1 m height near ticket-machine\n•  Above 200 Lux = 3;\n•  Between100– 200 Lux: 0,03 pt per Lux over 100\n•  Below 100 Lux = 0",{"$f":"VLOOKUP(A22,Languages!$C$4:$I$273,1+'Languages Available'!$D$1)","v":19}]
[20,"Exit; at 1 m height near barrier/ticket-machine\n•  Above 200 Lux = 3;\n•  Between100– 200 Lux: 0,03 pt per Lux over 100\n•  Below 100 Lux= 0",{"$f":"VLOOKUP(A23,Languages!$C$4:$I$273,1+'Languages Available'!$D$1)","v":20}]
[21,"At pay-machine; at 1 m height\n•  Above 200 Lux =4;\n•  Between100– 200 Lux: 0,04 pt per Lux over 100\n•  Below 100 Lux= 0;\n•  No Pay Machines : same as exit (enter zero if this is the case)",{"$f":"VLOOKUP(A24,Languages!$C$4:$I$273,1+'Languages Available'!$D$1)","v":21}]
[22,"At cashier; at counter height\n•  Above 200 Lux =4;\n•  Between100– 200 Lux: 0,04 pt per Lux over 100\n•  Below 100 Lux= 0;\n•  No cashier = 3 (enter zero if this is the case)",{"$f":"VLOOKUP(A25,Languages!$C$4:$I$273,1+'Languages Available'!$D$1)","v":22}]
[23,"In elevator; at floor level\n•  Above 70 Lux = 4;\n•  Between30– 70 Lux: 0,1 pt per Lux over 30\n•  Below 30 Lux = 0;\n•  Single level without elevator = 3 (enter zero if this is the case)",{"$f":"VLOOKUP(A26,Languages!$C$4:$I$273,1+'Languages Available'!$D$1)","v":23}]
[24,"In staircases and all other exclusive pedestrian routes; at floor level\n•  Above 90 Lux = 3;\n•  Between30– 90 Lux: 0,05 pt per Lux over 30\n•  Below 30 Lux = 0;",{"$f":"VLOOKUP(A27,Languages!$C$4:$I$273,1+'Languages Available'!$D$1)","v":24}]
[25,"Light levels on parking area at floor level: (plesase fill grid below) \nAverage light level of grid:\n•  Above 100 Lux= 10;\n•  Between20– 100 Lux: 0,125 pt per Lux over 20 \n•  Below 20 Lux= 0",{"$f":"VLOOKUP(A28,Languages!$C$4:$I$273,1+'Languages Available'!$D$1)","v":25}]
[26,"Uniformity of light levels in grid as standard deviation\n•  Under 25% of avg light level = 10;\n•  Between25– 50%: 0,4 pt per % under 50%\n•  Above 50% =  0",{"$f":"VLOOKUP(A29,Languages!$C$4:$I$273,1+'Languages Available'!$D$1)","v":26}]
[27,"Auxiliary Grid for 2.8",{"$f":"VLOOKUP(A30,Languages!$C$4:$I$273,1+'Languages Available'!$D$1)","v":27}]
[28,"end of parking space under/between light fitting",{"$f":"VLOOKUP(A31,Languages!$C$4:$I$273,1+'Languages Available'!$D$1)","v":28}]
[29,"halfway parking space under/between light fitting",{"$f":"VLOOKUP(A32,Languages!$C$4:$I$273,1+'Languages Available'!$D$1)","v":29}]
[30,"edge of driveway under/between light fitting",{"$f":"VLOOKUP(A33,Languages!$C$4:$I$273,1+'Languages Available'!$D$1)","v":30}]
[31,"center of driveway under/between light fitting",{"$f":"VLOOKUP(A34,Languages!$C$4:$I$273,1+'Languages Available'!$D$1)","v":31}]
[32,"other edge of driveway under/between light fitting",{"$f":"VLOOKUP(A35,Languages!$C$4:$I$273,1+'Languages Available'!$D$1)","v":32}]
[33,"Car Entry / Car Exit",{"$f":"VLOOKUP(A36,Languages!$C$4:$I$273,1+'Languages Available'!$D$1)","v":33}]
[34,"Car park headroom limit identified at entrance",{"$f":"VLOOKUP(A37,Languages!$C$4:$I$273,1+'Languages Available'!$D$1)","v":34}]
[35,"Correct sign at entrance",{"$f":"VLOOKUP(A38,Languages!$C$4:$I$273,1+'Languages Available'!$D$1)","v":35}]
[36,"Height barrier",{"$f":"VLOOKUP(A39,Languages!$C$4:$I$273,1+'Languages Available'!$D$1)","v":36}]
[37,"Rubber lip to prevent damage",{"$f":"VLOOKUP(A40,Languages!$C$4:$I$273,1+'Languages Available'!$D$1)","v":37}]
[38,"Height:\n(The car park should receive one point for each 10cm of height above 1.90m up to 2.20 m)",{"$f":"VLOOKUP(A41,Languages!$C$4:$I$273,1+'Languages Available'!$D$1)","v":38}]
[39,"Traffic signs to define limitations in use of facility.\n• Clear signing = 3\n• Incomplete signing = 2\n• No signing = 0)",{"$f":"VLOOKUP(A42,Languages!$C$4:$I$273,1+'Languages Available'!$D$1)","v":39}]
[40,"Information on:",{"$f":"VLOOKUP(A43,Languages!$C$4:$I$273,1+'Languages Available'!$D$1)","v":40}]
[41,"Operators terms & conditions within the car park:",{"$f":"VLOOKUP(A44,Languages!$C$4:$I$273,1+'Languages Available'!$D$1)","v":41}]
[42,"Daily opening hours:",{"$f":"VLOOKUP(A45,Languages!$C$4:$I$273,1+'Languages Available'!$D$1)","v":42}]
[43,"Scale of tariffs:",{"$f":"VLOOKUP(A46,Languages!$C$4:$I$273,1+'Languages Available'!$D$1)","v":43}]
[44,"Readibility of tariff system:",{"$f":"VLOOKUP(A47,Languages!$C$4:$I$273,1+'Languages Available'!$D$1)","v":44}]
[45,"Design entry/exit area",{"$f":"VLOOKUP(A48,Languages!$C$4:$I$273,1+'Languages Available'!$D$1)","v":45}]
[46,"Entry ticket- machine easy to reach:",{"$f":"VLOOKUP(A49,Languages!$C$4:$I$273,1+'Languages Available'!$D$1)","v":46}]
[47,"Exit ticket- machine easy to reach:",{"$f":"VLOOKUP(A50,Languages!$C$4:$I$273,1+'Languages Available'!$D$1)","v":47}]
[48,"Longitudinal slope at the ticket machines",{"$f":"VLOOKUP(A51,Languages!$C$4:$I$273,1+'Languages Available'!$D$1)","v":48}]
[49,"Entry lane:\n• 0-2% (car doesn’t move without brake) = 1\n• 2-5% = 0\n• Above 5% = -1",{"$f":"VLOOKUP(A52,Languages!$C$4:$I$273,1+'Languages Available'!$D$1)","v":49}]
[50,"Exit lane:\n• 0-2% (car doesn’t move without brake) = 1\n• 2-5% = 0\n• Above 5% = -1",{"$f":"VLOOKUP(A53,Languages!$C$4:$I$273,1+'Languages Available'!$D$1)","v":50}]
[51,"Kerb design to avoid damage to average vehicle’s wheels:\n(Yes = 2, No protection = 0, No kerbs in entry/exit area = 2)",{"$f":"VLOOKUP(A54,Languages!$C$4:$I$273,1+'Languages Available'!$D$1)","v":51}]
[52,"Anti slip surfaces access/egress ramps:\n(Anti slip = 1, Slippery when wet = 0)",{"$f":"VLOOKUP(A55,Languages!$C$4:$I$273,1+'Languages Available'!$D$1)","v":52}]
[53,"Access security",{"$f":"VLOOKUP(A56,Languages!$C$4:$I$273,1+'Languages Available'!$D$1)","v":53}]
[54,"Barrier",{"$f":"VLOOKUP(A57,Languages!$C$4:$I$273,1+'Languages Available'!$D$1)","v":54}]
[55,"Intercom",{"$f":"VLOOKUP(A58,Languages!$C$4:$I$273,1+'Languages Available'!$D$1)","v":55}]
[56,"CCTV",{"$f":"VLOOKUP(A59,Languages!$C$4:$I$273,1+'Languages Available'!$D$1)","v":56}]
[57,"Licence Plate Recognition",{"$f":"VLOOKUP(A60,Languages!$C$4:$I$273,1+'Languages Available'!$D$1)","v":57}]
[58,"Full height fast closing gates",{"$f":"VLOOKUP(A61,Languages!$C$4:$I$273,1+'Languages Available'!$D$1)","v":58}]
[59,"Staffed access(Entry or exit)",{"$f":"VLOOKUP(A62,Languages!$C$4:$I$273,1+'Languages Available'!$D$1)","v":59}]
[60,"Entry/Exit of the building: width between structure (per lane)\n(< 3 m =0, 3 – 3.3 m =1, > 3.3 m = 2)",{"$f":"VLOOKUP(A63,Languages!$C$4:$I$273,1+'Languages Available'!$D$1)","v":60}]
[61,"Exit: exit slope ends at least 5 meters before crossing traffic (pedestrians/cyclists):",{"$f":"VLOOKUP(A64,Languages!$C$4:$I$273,1+'Languages Available'!$D$1)","v":61}]
[62,"subtotal  car entry/exit",{"$f":"VLOOKUP(A65,Languages!$C$4:$I$273,1+'Languages Available'!$D$1)","v":62}]
[63,"Parking Area",{"$f":"VLOOKUP(A66,Languages!$C$4:$I$273,1+'Languages Available'!$D$1)","v":63}]
[64,"Pillar placement for at least 85% of bays:\n• does not intrude into the parking area = 8 \n• at beginning of stall = 0\n• next to car door = 0\n• at back of stall but intrudes into the parking area = 4",{"$f":"VLOOKUP(A67,Languages!$C$4:$I$273,1+'Languages Available'!$D$1)","v":64}]
[65,"Visibility (many/few dead corners, walls in the car park etc.)\nGood=4, Medium=2 or Bad=0",{"$f":"VLOOKUP(A68,Languages!$C$4:$I$273,1+'Languages Available'!$D$1)","v":65}]
[66,"Signage for car driver:",{"$f":"VLOOKUP(A69,Languages!$C$4:$I$273,1+'Languages Available'!$D$1)","v":66}]
[{"$f":"A69+1","v":67},"Do traffic signs conform to national road code?",{"$f":"VLOOKUP(A70,Languages!$C$4:$I$273,1+'Languages Available'!$D$1)","v":67}]
[68,"Routing and turn signs: Is signage clear, complete and unambiguous? ",{"$f":"VLOOKUP(A71,Languages!$C$4:$I$273,1+'Languages Available'!$D$1)","v":68}]
[69,"Complete ?",{"$f":"VLOOKUP(A72,Languages!$C$4:$I$273,1+'Languages Available'!$D$1)","v":69}]
[70,"Easy to see ?",{"$f":"VLOOKUP(A73,Languages!$C$4:$I$273,1+'Languages Available'!$D$1)","v":70}]
[71,"Unambiguous ?",{"$f":"VLOOKUP(A74,Languages!$C$4:$I$273,1+'Languages Available'!$D$1)","v":71}]
[72,"Exit signs in the car park: Is signage clear, complete and unambiguous? ",{"$f":"VLOOKUP(A75,Languages!$C$4:$I$273,1+'Languages Available'!$D$1)","v":72}]
[73,"Complete ?",{"$f":"VLOOKUP(A76,Languages!$C$4:$I$273,1+'Languages Available'!$D$1)","v":73}]
[74,"Easy to see ?",{"$f":"VLOOKUP(A77,Languages!$C$4:$I$273,1+'Languages Available'!$D$1)","v":74}]
[75,"Unambiguous ?",{"$f":"VLOOKUP(A78,Languages!$C$4:$I$273,1+'Languages Available'!$D$1)","v":75}]
[76,"Parking bay marks",{"$f":"VLOOKUP(A79,Languages!$C$4:$I$273,1+'Languages Available'!$D$1)","v":76}]
[77,"Parking bays are clearly marked ?",{"$f":"VLOOKUP(A80,Languages!$C$4:$I$273,1+'Languages Available'!$D$1)","v":77}]
[78,"Bay markings extend up walls to assist driver ?",{"$f":"VLOOKUP(A81,Languages!$C$4:$I$273,1+'Languages Available'!$D$1)","v":78}]
[79,"Are Road Markings:",{"$f":"VLOOKUP(A82,Languages!$C$4:$I$273,1+'Languages Available'!$D$1)","v":79}]
[80,"Complete ?",{"$f":"VLOOKUP(A83,Languages!$C$4:$I$273,1+'Languages Available'!$D$1)","v":80}]
[81,"Easy to see ?",{"$f":"VLOOKUP(A84,Languages!$C$4:$I$273,1+'Languages Available'!$D$1)","v":81}]
[82,"Unambiguous ?",{"$f":"VLOOKUP(A85,Languages!$C$4:$I$273,1+'Languages Available'!$D$1)","v":82}]
[83,"Availability of spaces for disabled with wheelchair access anounced at the entrance the car park:",{"$f":"VLOOKUP(A86,Languages!$C$4:$I$273,1+'Languages Available'!$D$1)","v":83}]
[84,"Accessible for wheelchair ?",{"$f":"VLOOKUP(A87,Languages!$C$4:$I$273,1+'Languages Available'!$D$1)","v":84}]
[85,"Bays minimum 3.5 m wide ?",{"$f":"VLOOKUP(A88,Languages!$C$4:$I$273,1+'Languages Available'!$D$1)","v":85}]
[86,"Close to pedestrian exit ?",{"$f":"VLOOKUP(A89,Languages!$C$4:$I$273,1+'Languages Available'!$D$1)","v":86}]
[87,"Guidance to disabled spaces ?",{"$f":"VLOOKUP(A90,Languages!$C$4:$I$273,1+'Languages Available'!$D$1)","v":87}]
[88,"Parking angle at 85 % of bays:\n(Angle 76-90° = 0, Angle  45-75° = 2)",{"$f":"VLOOKUP(A91,Languages!$C$4:$I$273,1+'Languages Available'!$D$1)","v":88}]
[89,"Width of bays (85 % of bays), A or B: \nA: Parking angle 76 – 90 degrees\n(2.25m = -5, 2.30m = 0, 2.35m = 2, 2.40m = 4, 2.45m = 6, 2.50m = 8) \nB: Parking angle 45-75 degrees\n(2.25m = -5, 2.30m = 1, 2.35m = 3, 2.40m = 5, 2.45m = 8)\nWidth of 2.25m only applies for renovated car parks, new car parks must be minimum 2.30m",{"$f":"VLOOKUP(A92,Languages!$C$4:$I$273,1+'Languages Available'!$D$1)","v":89}]
[90,"Total unit measure of one way isle width and\ndepth of two parking bays, depending on parking angle and bay width:\nBay width: 2.50m / 2.45m / 2.40m / 2.35m / 2.30m\n90° :           16.00 /  16.30 /  16.60 /  16.90 / 17.30\n85° :           15.70 /  16.00 /  16.30 /  16.60 / 16.95\n80° :           15.40 /  15.70 /  16.00 /  16.30 / 16.60\n75° :           14.95 /  15.25 /  15.55 /  15.85 / 16.15\n70° :           14.50 /  14.80 /  15.10 /  15.40 / 15.70\n65° :           14.40 /  14.40 /  14.55 /  14.80 / 15.10\n60° :           14.30 /  14.30 /  14.30 /  14.30 / 14.50\n55° :           14.00 /  14.00 /  14.00 /  14.00 / 14.10\n50° :           13.75 /  13.75 /  13.75 /  13.75 / 13.75\n45° :           13.50 /  13.50 /  13.50 /  13.50 / 13.50\n\nTotal unit measure as above qualifies for 3 points. \nUp to 30 cm less qualifies for 2 points\nUp to 60 cm less qualifies for 1 point\nMore than 60 cm less: no points given",{"$f":"VLOOKUP(A93,Languages!$C$4:$I$273,1+'Languages Available'!$D$1)","v":90}]
[91,"Kerb design to avoid damage to average vehicle’s wheels\n•  Yes = 2, No protection = 0",{"$f":"VLOOKUP(A94,Languages!$C$4:$I$273,1+'Languages Available'!$D$1)","v":91}]
[92,"Vehicle Ramps",{"$f":"VLOOKUP(A95,Languages!$C$4:$I$273,1+'Languages Available'!$D$1)","v":92}]
[93,"Is this a Single level car park without vehicular ramps or ramper floor?",{"$f":"VLOOKUP(A96,Languages!$C$4:$I$273,1+'Languages Available'!$D$1)","v":93}]
[94,"Ramp surface between parking areas (Anti slip 1, Smooth 0, no ramps 1)",{"$f":"VLOOKUP(A97,Languages!$C$4:$I$273,1+'Languages Available'!$D$1)","v":94}]
[95,"Ramp longitudinal gradient connecting ramps (not used for parking)\n•  <10%=3, 10-15%=1, >15%=0, no ramps=3",{"$f":"VLOOKUP(A98,Languages!$C$4:$I$273,1+'Languages Available'!$D$1)","v":95}]
[96,"Ramp width (between kerbs) all ramps measured at narrowest point ",{"$f":"VLOOKUP(A99,Languages!$C$4:$I$273,1+'Languages Available'!$D$1)","v":96}]
[97,"Curved ramps must be 1 m wider for same score. Are the ramps curbed?",{"$f":"VLOOKUP(A100,Languages!$C$4:$I$273,1+'Languages Available'!$D$1)","v":97}]
[98,{"$f":"CONCATENATE(\"Please choose width. \",IF(rampsCurved=yes,\"< 4m=0, 4-4.3m=1, >4.3m=2, no ramps=2\",\"< 3m=0, 3-3.3m=1, >3.3m=2, no ramps=2\"))","v":"Please choose width. < 3m=0, 3-3.3m=1, >3.3m=2, no ramps=2"},{"$f":"VLOOKUP(A101,Languages!$C$4:$I$273,1+'Languages Available'!$D$1)","v":98}]
[99,"Ramp curvature (external radius) curved ramps\n•  up to 9m=0, 9–10 m=1, >10m=2, no ramps=2\nAt dual way ramps this measure refers to the inner lane.",{"$f":"VLOOKUP(A102,Languages!$C$4:$I$273,1+'Languages Available'!$D$1)","v":99}]
[100,"Approach curve to straight ramps\n•  <7.5m=0, 7.5–9m=1, >9m=2, no ramps=2",{"$f":"VLOOKUP(A103,Languages!$C$4:$I$273,1+'Languages Available'!$D$1)","v":100}]
[101,"Ramped parking floor longitudinal gradient\n•  <5%=3, 5-7 =1, >7%=0, no gradient=3",{"$f":"VLOOKUP(A104,Languages!$C$4:$I$273,1+'Languages Available'!$D$1)","v":101}]
[102,"Pedestrian Access",{"$f":"VLOOKUP(A105,Languages!$C$4:$I$273,1+'Languages Available'!$D$1)","v":102}]
[103,"Item List",{"$f":"VLOOKUP(A106,Languages!$C$4:$I$273,1+'Languages Available'!$D$1)","v":103}]
[104,"Headroom for pedestrians - excluding doors\n• <2.00m = 0\n• 2.00m – 2.10m = 1\n• 2.10m – 2.20m = 2\n• > 2.20m = 3",{"$f":"VLOOKUP(A107,Languages!$C$4:$I$273,1+'Languages Available'!$D$1)","v":104}]
[105,"Separate walking route (i.e. heightened; zebra stripes or colours) (yes = 2, no = 0)",{"$f":"VLOOKUP(A108,Languages!$C$4:$I$273,1+'Languages Available'!$D$1)","v":105}]
[106,"Are pedestrian entrance doors easy to use?\n(Yes, automatic or open connection = 4, Easy to open = 2, No = 0)",{"$f":"VLOOKUP(A109,Languages!$C$4:$I$273,1+'Languages Available'!$D$1)","v":106}]
[107,"Pedestrian access controlled by ticket/pass card when car park open (Yes=1, No=0)",{"$f":"VLOOKUP(A110,Languages!$C$4:$I$273,1+'Languages Available'!$D$1)","v":107}]
[108,"City plan a central location in car park:\n(On Every pedestrian exit = 2, One location = 1, No = 0)",{"$f":"VLOOKUP(A111,Languages!$C$4:$I$273,1+'Languages Available'!$D$1)","v":108}]
[109,"Guidance:",{"$f":"VLOOKUP(A112,Languages!$C$4:$I$273,1+'Languages Available'!$D$1)","v":109}]
[110,"to key attractions around the car park at pedestrian exit (Yes=1, No=0):",{"$f":"VLOOKUP(A113,Languages!$C$4:$I$273,1+'Languages Available'!$D$1)","v":110}]
[111,"around the car park to pedestrian entrances (Yes=1, No=0):",{"$f":"VLOOKUP(A114,Languages!$C$4:$I$273,1+'Languages Available'!$D$1)","v":111}]
[112,"Is this a Single level car park at ground floor, (not open surface) ?",{"$f":"VLOOKUP(A115,Languages!$C$4:$I$273,1+'Languages Available'!$D$1)","v":112}]
[113,"Is there elevators serving street level?",{"$f":"VLOOKUP(A116,Languages!$C$4:$I$273,1+'Languages Available'!$D$1)","v":113}]
[114,"Number of Elevators at street level:\n(1 elevator = 1, 2 + elevators = 5)",{"$f":"VLOOKUP(A117,Languages!$C$4:$I$273,1+'Languages Available'!$D$1)","v":114}]
[115,"Size of elevators:\n(More Than 8 people = 3, 4-8 people = 1, less than 4 = 0)",{"$f":"VLOOKUP(A118,Languages!$C$4:$I$273,1+'Languages Available'!$D$1)","v":115}]
[116,"Visibility from elevator inside to hall/parking area\n(no visibility from elevator = 0, glazed doors/walls = 3, no elevator = 0)",{"$f":"VLOOKUP(A119,Languages!$C$4:$I$273,1+'Languages Available'!$D$1)","v":116}]
[117,"Level indication:",{"$f":"VLOOKUP(A120,Languages!$C$4:$I$273,1+'Languages Available'!$D$1)","v":117}]
[118,"in elevator:",{"$f":"VLOOKUP(A121,Languages!$C$4:$I$273,1+'Languages Available'!$D$1)","v":118}]
[119,"in elevator foyer:",{"$f":"VLOOKUP(A122,Languages!$C$4:$I$273,1+'Languages Available'!$D$1)","v":119}]
[120,"Elevator control buttons at wheelchair height\n•  Yes = 1, Other = 0",{"$f":"VLOOKUP(A123,Languages!$C$4:$I$273,1+'Languages Available'!$D$1)","v":120}]
[121,"Doors directly to parking area",{"$f":"VLOOKUP(A124,Languages!$C$4:$I$273,1+'Languages Available'!$D$1)","v":121}]
[122,"Width (<90 cm =0, >=90 cm = 2)",{"$f":"VLOOKUP(A125,Languages!$C$4:$I$273,1+'Languages Available'!$D$1)","v":122}]
[123,"Emergency door, standard open (Yes=2, No= 0)",{"$f":"VLOOKUP(A126,Languages!$C$4:$I$273,1+'Languages Available'!$D$1)","v":123}]
[124,"Visibility (Glazed door/wall = 3, No Glass = 0)",{"$f":"VLOOKUP(A127,Languages!$C$4:$I$273,1+'Languages Available'!$D$1)","v":124}]
[125,"Are elevators the main vertical connection? (stairs only secondary or escape)",{"$f":"VLOOKUP(A128,Languages!$C$4:$I$273,1+'Languages Available'!$D$1)","v":125}]
[126,"Stairwells (visibility and orientation)",{"$f":"VLOOKUP(A129,Languages!$C$4:$I$273,1+'Languages Available'!$D$1)","v":126}]
[127,"Clear View (Yes = 1, No = 0, Irrelevant = 1)",{"$f":"VLOOKUP(A130,Languages!$C$4:$I$273,1+'Languages Available'!$D$1)","v":127}]
[128,"Level Indication (Yes = 1, No = 0, Irrelevant = 1)",{"$f":"VLOOKUP(A131,Languages!$C$4:$I$273,1+'Languages Available'!$D$1)","v":128}]
[129,"Stairs (incl. heightened visibility of steps)",{"$f":"VLOOKUP(A132,Languages!$C$4:$I$273,1+'Languages Available'!$D$1)","v":129}]
[130,"Width (< 1.5 m = 0, > 1.5m = 2)",{"$f":"VLOOKUP(A133,Languages!$C$4:$I$273,1+'Languages Available'!$D$1)","v":130}]
[{"$f":"A133+1","v":131},"Hand Rails (No hand rail =0, One Side = 1, Two sides=2)",{"$f":"VLOOKUP(A134,Languages!$C$4:$I$273,1+'Languages Available'!$D$1)","v":131}]
[132,"Heightened visibility of steps for people with poor eyesight (Yes = 2, No = 0)",{"$f":"VLOOKUP(A135,Languages!$C$4:$I$273,1+'Languages Available'!$D$1)","v":132}]
[133,"Anti-slip surfacing on stairs: (Yes = 2, No = 0)",{"$f":"VLOOKUP(A136,Languages!$C$4:$I$273,1+'Languages Available'!$D$1)","v":133}]
[134,"External openings in stairwell\n(window/grilled to outside or car park  =2, none =0)",{"$f":"VLOOKUP(A137,Languages!$C$4:$I$273,1+'Languages Available'!$D$1)","v":134}]
[135,"Security Equipment",{"$f":"VLOOKUP(A138,Languages!$C$4:$I$273,1+'Languages Available'!$D$1)","v":135}]
[136,"Item List",{"$f":"VLOOKUP(A139,Languages!$C$4:$I$273,1+'Languages Available'!$D$1)","v":136}]
[137,"CCTV with notice at entrance = 3, No CCTV =0",{"$f":"VLOOKUP(A140,Languages!$C$4:$I$273,1+'Languages Available'!$D$1)","v":137}]
[138,"Staff surveillance (on-site or remote)\n•  Yes = 5, No = 0",{"$f":"VLOOKUP(A141,Languages!$C$4:$I$273,1+'Languages Available'!$D$1)","v":138}]
[139,"CCTV at:",{"$f":"VLOOKUP(A142,Languages!$C$4:$I$273,1+'Languages Available'!$D$1)","v":139}]
[140,"Car Entry: Yes =1, No =0",{"$f":"VLOOKUP(A143,Languages!$C$4:$I$273,1+'Languages Available'!$D$1)","v":140}]
[141," Car Exit: Yes =1, No =0",{"$f":"VLOOKUP(A144,Languages!$C$4:$I$273,1+'Languages Available'!$D$1)","v":141}]
[142,"Pay Machine: Yes =1, No =0",{"$f":"VLOOKUP(A145,Languages!$C$4:$I$273,1+'Languages Available'!$D$1)","v":142}]
[143,"Elevator Hall, every level: Yes =1, No =0",{"$f":"VLOOKUP(A146,Languages!$C$4:$I$273,1+'Languages Available'!$D$1)","v":143}]
[144,"Stairwells, every level: Yes =1, No =0",{"$f":"VLOOKUP(A147,Languages!$C$4:$I$273,1+'Languages Available'!$D$1)","v":144}]
[145,"Pedestrian Entrances: Yes =1, No =0",{"$f":"VLOOKUP(A148,Languages!$C$4:$I$273,1+'Languages Available'!$D$1)","v":145}]
[146,"Most of Parking Area (65%):Yes =3, No =0",{"$f":"VLOOKUP(A149,Languages!$C$4:$I$273,1+'Languages Available'!$D$1)","v":146}]
[147," Ramps: Yes = 1, No = 0",{"$f":"VLOOKUP(A150,Languages!$C$4:$I$273,1+'Languages Available'!$D$1)","v":147}]
[148,"Staff contactable via:",{"$f":"VLOOKUP(A151,Languages!$C$4:$I$273,1+'Languages Available'!$D$1)","v":148}]
[149,"Intercom at pay machine and/or controlled entries (24/7=3, All access hours if not 24/7= 2, Part time/not available = 0)",{"$f":"VLOOKUP(A152,Languages!$C$4:$I$273,1+'Languages Available'!$D$1)","v":149}]
[150,"Emergency call system in parking area (24/7=3, All access hours if not 24/7= 2, Part time/not available = 0)",{"$f":"VLOOKUP(A153,Languages!$C$4:$I$273,1+'Languages Available'!$D$1)","v":150}]
[151,"Recognizable staff present and patrolling car park\n(24/7 = 3, During access Hours = 2, Less than access Hours = 1, No = 0)",{"$f":"VLOOKUP(A154,Languages!$C$4:$I$273,1+'Languages Available'!$D$1)","v":151}]
[152,"Lockable vehicle exit/entry: \n(Closed gate/rolling shutter  after access hours = 2, Secured: fast opening gate during day = 4, Secured: slow opening gate during day = 2, No provisions = 0)",{"$f":"VLOOKUP(A155,Languages!$C$4:$I$273,1+'Languages Available'!$D$1)","v":152}]
[153,"Lockable pedestrian exit/entry (after opening hours).\n(Door/gate/rolling shutter <= 15cm maximum aperture = 2, over 15 cm = 0, no provisions = 0, Irrelevant (24 hours opening) = 2)",{"$f":"VLOOKUP(A156,Languages!$C$4:$I$273,1+'Languages Available'!$D$1)","v":153}]
[154,"Grilles on external openings & security grilles\n(<= 15 cm = 2, > 15 cm or no protection= 0, Irrelevant (no external openings) = 2)",{"$f":"VLOOKUP(A157,Languages!$C$4:$I$273,1+'Languages Available'!$D$1)","v":154}]
[155,"Wayfinding Inside and Outside",{"$f":"VLOOKUP(A158,Languages!$C$4:$I$273,1+'Languages Available'!$D$1)","v":155}]
[156,"Item List",{"$f":"VLOOKUP(A159,Languages!$C$4:$I$273,1+'Languages Available'!$D$1)","v":156}]
[157,"Identification of vacant parking spaces",{"$f":"VLOOKUP(A160,Languages!$C$4:$I$273,1+'Languages Available'!$D$1)","v":157}]
[158,"Parking floor level (yes/good = 2, no/bad = 0)",{"$f":"VLOOKUP(A161,Languages!$C$4:$I$273,1+'Languages Available'!$D$1)","v":158}]
[159,"Parking row (yes/good = 1, no/bad = 0)",{"$f":"VLOOKUP(A162,Languages!$C$4:$I$273,1+'Languages Available'!$D$1)","v":159}]
[160,"Individual stall indication (yes/good = 2, no/bad = 0)",{"$f":"VLOOKUP(A163,Languages!$C$4:$I$273,1+'Languages Available'!$D$1)","v":160}]
[161,"Way finding (vehicles)",{"$f":"VLOOKUP(A164,Languages!$C$4:$I$273,1+'Languages Available'!$D$1)","v":161}]
[162,"Are floors clearly and separately identified for drivers? (Good =3, Adequate =2, Poor =1, No =0)",{"$f":"VLOOKUP(A165,Languages!$C$4:$I$273,1+'Languages Available'!$D$1)","v":162}]
[163,"Are sub-areas of floors clearly identified for drivers? (Good =3, Adequate =2, Poor =1, No =0)",{"$f":"VLOOKUP(A166,Languages!$C$4:$I$273,1+'Languages Available'!$D$1)","v":163}]
[164,"Are fire escapes and escape routes clearly marked\n• Clear from all locations = 3\n• most locations= 2\n• some locations=1\n• No marking of escape routes=0)",{"$f":"VLOOKUP(A167,Languages!$C$4:$I$273,1+'Languages Available'!$D$1)","v":164}]
[165,"Are floor levels clearly marked?\n(good =3, adequate=2, poor=1, none =0. Single level car parks = 3)",{"$f":"VLOOKUP(A168,Languages!$C$4:$I$273,1+'Languages Available'!$D$1)","v":165}]
[166,"Is there additional signing or prompts to orient the pedestrian on the parking deck\n(good =2, some =1, none = 0)",{"$f":"VLOOKUP(A169,Languages!$C$4:$I$273,1+'Languages Available'!$D$1)","v":166}]
[167,"Are parking spaces individually numbered\n(Numbered including floor identification =2, Just numbers =1, none =0)",{"$f":"VLOOKUP(A170,Languages!$C$4:$I$273,1+'Languages Available'!$D$1)","v":167}]
[168,"Use of colours for  way finding\n(Yes= 1, No= 0)",{"$f":"VLOOKUP(A171,Languages!$C$4:$I$273,1+'Languages Available'!$D$1)","v":168}]
[169,"Guidance sign posting for cars on roads to car park",{"$f":"VLOOKUP(A172,Languages!$C$4:$I$273,1+'Languages Available'!$D$1)","v":169}]
[170,"Static sign system only (Yes = 1, No = 0)",{"$f":"VLOOKUP(A173,Languages!$C$4:$I$273,1+'Languages Available'!$D$1)","v":170}]
[171,"Dynamic sign system additionally (Yes = 1, No = 0)",{"$f":"VLOOKUP(A174,Languages!$C$4:$I$273,1+'Languages Available'!$D$1)","v":171}]
[172,"Illuminated signage at car park entrance",{"$f":"VLOOKUP(A175,Languages!$C$4:$I$273,1+'Languages Available'!$D$1)","v":172}]
[173,"Signal green arrow, red cross for direction (Yes = 1, No = 0)",{"$f":"VLOOKUP(A176,Languages!$C$4:$I$273,1+'Languages Available'!$D$1)","v":173}]
[174,"Signal full/free (Yes = 1, No = 0)",{"$f":"VLOOKUP(A177,Languages!$C$4:$I$273,1+'Languages Available'!$D$1)","v":174}]
[175,"Signage at pedestrian entrance (Yes = 1, No = 0)",{"$f":"VLOOKUP(A178,Languages!$C$4:$I$273,1+'Languages Available'!$D$1)","v":175}]
[176,"Comfort and Miscellaneous",{"$f":"VLOOKUP(A179,Languages!$C$4:$I$273,1+'Languages Available'!$D$1)","v":176}]
[177,"Notice-board at pedestrian entrance/exit showing:",{"$f":"VLOOKUP(A180,Languages!$C$4:$I$273,1+'Languages Available'!$D$1)","v":177}]
[178,"Access hours normal/special (yes = 1, no = 0)",{"$f":"VLOOKUP(A181,Languages!$C$4:$I$273,1+'Languages Available'!$D$1)","v":178}]
[179,"Readable & understandable tariff board (yes = 1, no = 0)",{"$f":"VLOOKUP(A182,Languages!$C$4:$I$273,1+'Languages Available'!$D$1)","v":179}]
[180,"Operators terms and conditions (yes = 1, no = 0)",{"$f":"VLOOKUP(A183,Languages!$C$4:$I$273,1+'Languages Available'!$D$1)","v":180}]
[181,"Payment options (pay at exit/pay at pay station):",{"$f":"VLOOKUP(A184,Languages!$C$4:$I$273,1+'Languages Available'!$D$1)","v":181}]
[182,"Accepts coins? (yes =1, no =0)",{"$f":"VLOOKUP(A185,Languages!$C$4:$I$273,1+'Languages Available'!$D$1)","v":182}]
[183,"Change given? (yes =1, no =0)",{"$f":"VLOOKUP(A186,Languages!$C$4:$I$273,1+'Languages Available'!$D$1)","v":183}]
[184,"Accepts banknotes?  (yes =1, no =0)",{"$f":"VLOOKUP(A187,Languages!$C$4:$I$273,1+'Languages Available'!$D$1)","v":184}]
[185,"Accepts bank cards?  (yes =1, no =0)",{"$f":"VLOOKUP(A188,Languages!$C$4:$I$273,1+'Languages Available'!$D$1)","v":185}]
[186,"Payment by smart phone? (yes =1, no =0)",{"$f":"VLOOKUP(A189,Languages!$C$4:$I$273,1+'Languages Available'!$D$1)","v":186}]
[187,"Payment by card/phone at exit? (yes =1, no =0)",{"$f":"VLOOKUP(A190,Languages!$C$4:$I$273,1+'Languages Available'!$D$1)","v":187}]
[188,"ID & payment by LPR? (yes =1, no =0)",{"$f":"VLOOKUP(A191,Languages!$C$4:$I$273,1+'Languages Available'!$D$1)","v":188}]
[189,"Accepts other cards: How many? (1 point per additional option up to 3)",{"$f":"VLOOKUP(A192,Languages!$C$4:$I$273,1+'Languages Available'!$D$1)","v":189}]
[190,"Payment at staffed desk: (yes = 1, no = 0)",{"$f":"VLOOKUP(A193,Languages!$C$4:$I$273,1+'Languages Available'!$D$1)","v":190}]
[191,"Is this a Pay and Display Car Park?",{"$f":"VLOOKUP(A194,Languages!$C$4:$I$273,1+'Languages Available'!$D$1)","v":191}]
[192,"Number of Pay points for Barrier controlled car parks:\n(One pay station = 0,  More than one =1, One at each pedestrian entrance, excluding fire escapes =2, More than one at each pedestrian entrance =3)",{"$f":"VLOOKUP(A195,Languages!$C$4:$I$273,1+'Languages Available'!$D$1)","v":192}]
[193,"Number of Pay points for Pay and Display Car Parks\n(One =0, < 1 for every 50 spaces =2, >1 for every 50 spaces =3)",{"$f":"VLOOKUP(A196,Languages!$C$4:$I$273,1+'Languages Available'!$D$1)","v":193}]
[194,"Customer toilets:",{"$f":"VLOOKUP(A197,Languages!$C$4:$I$273,1+'Languages Available'!$D$1)","v":194}]
[{"$f":"A197+1","v":195},"Exist? (yes= 2, no= 0)",{"$f":"VLOOKUP(A198,Languages!$C$4:$I$273,1+'Languages Available'!$D$1)","v":195}]
[196,"Disabled toilet? (yes=1, no= 0)",{"$f":"VLOOKUP(A199,Languages!$C$4:$I$273,1+'Languages Available'!$D$1)","v":196}]
[197,"unisex = 0, male/female separated = 1",{"$f":"VLOOKUP(A200,Languages!$C$4:$I$273,1+'Languages Available'!$D$1)","v":197}]
[198,"attendant: yes=1, no= 0",{"$f":"VLOOKUP(A201,Languages!$C$4:$I$273,1+'Languages Available'!$D$1)","v":198}]
[199,"Use of colours/ embellishing works",{"$f":"VLOOKUP(A202,Languages!$C$4:$I$273,1+'Languages Available'!$D$1)","v":199}]
[200,"Coloured pillars =1, no/concrete grey = 0",{"$f":"VLOOKUP(A203,Languages!$C$4:$I$273,1+'Languages Available'!$D$1)","v":200}]
[201,"Coloured walls =1, no/concrete grey = 0",{"$f":"VLOOKUP(A204,Languages!$C$4:$I$273,1+'Languages Available'!$D$1)","v":201}]
[202,"Extra embellishment",{"$f":"VLOOKUP(A205,Languages!$C$4:$I$273,1+'Languages Available'!$D$1)","v":202}]
[203," Artwork: (Yes = 2, No = 0)",{"$f":"VLOOKUP(A206,Languages!$C$4:$I$273,1+'Languages Available'!$D$1)","v":203}]
[204,"Planters: (Yes = 1, No = 0)",{"$f":"VLOOKUP(A207,Languages!$C$4:$I$273,1+'Languages Available'!$D$1)","v":204}]
[205,"Other: (Yes = 1, No = 0)",{"$f":"VLOOKUP(A208,Languages!$C$4:$I$273,1+'Languages Available'!$D$1)","v":205}]
[206,"Mobile phone coverage (Yes = 2, No = 0)",{"$f":"VLOOKUP(A209,Languages!$C$4:$I$273,1+'Languages Available'!$D$1)","v":206}]
[207,"Continuity of radio signals (Yes = 1, No = 0)",{"$f":"VLOOKUP(A210,Languages!$C$4:$I$273,1+'Languages Available'!$D$1)","v":207}]
[208,"Music",{"$f":"VLOOKUP(A211,Languages!$C$4:$I$273,1+'Languages Available'!$D$1)","v":208}]
[209,"Background music: yes = 2, No = 0",{"$f":"VLOOKUP(A212,Languages!$C$4:$I$273,1+'Languages Available'!$D$1)","v":209}]
[210,"Differentiation for way finding :  yes =1, No = 0",{"$f":"VLOOKUP(A213,Languages!$C$4:$I$273,1+'Languages Available'!$D$1)","v":210}]
[211,"Energy and Environment",{"$f":"VLOOKUP(A214,Languages!$C$4:$I$273,1+'Languages Available'!$D$1)","v":211}]
[212,"Energy Saving Lighting Systems",{"$f":"VLOOKUP(A215,Languages!$C$4:$I$273,1+'Languages Available'!$D$1)","v":212}]
[213,"Power Factor Compensation (Yes=1, No=0)",{"$f":"VLOOKUP(A216,Languages!$C$4:$I$273,1+'Languages Available'!$D$1)","v":213}]
[214,"Other Systems (Yes=1, No=0)",{"$f":"VLOOKUP(A217,Languages!$C$4:$I$273,1+'Languages Available'!$D$1)","v":214}]
[215,"Movement detection variable lights, remaining quality (yes= 2, no= 0)",{"$f":"VLOOKUP(A218,Languages!$C$4:$I$273,1+'Languages Available'!$D$1)","v":215}]
[216,"Adaptable lighting for daylight compensation at entrance area \n(yes= 2, no= 0)",{"$f":"VLOOKUP(A219,Languages!$C$4:$I$273,1+'Languages Available'!$D$1)","v":216}]
[217,"Adaptable lighting for ambient light conditions at parking floor from daylight\n(yes= 2, no= 0, Irrelevant (below ground) =2)",{"$f":"VLOOKUP(A220,Languages!$C$4:$I$273,1+'Languages Available'!$D$1)","v":217}]
[218,"Solar panels on the roof or other green energy initiatives (yes= 2, no= 0)",{"$f":"VLOOKUP(A221,Languages!$C$4:$I$273,1+'Languages Available'!$D$1)","v":218}]
[219,"Special treatment of cleaning water:\n•  yes= 2, no= 0",{"$f":"VLOOKUP(A222,Languages!$C$4:$I$273,1+'Languages Available'!$D$1)","v":219}]
[220,"Grey water or re-use of rain water\n•  yes= 2, no= 0\n",{"$f":"VLOOKUP(A223,Languages!$C$4:$I$273,1+'Languages Available'!$D$1)","v":220}]
[221,"Electric Vehicles recharging points: (Yes, more than one= 2, One recharging point=1, None=0)",{"$f":"VLOOKUP(A224,Languages!$C$4:$I$273,1+'Languages Available'!$D$1)","v":221}]
[222,"Car sharing and similar initiatives\n•  yes= 2, no= 0",{"$f":"VLOOKUP(A225,Languages!$C$4:$I$273,1+'Languages Available'!$D$1)","v":222}]
[223,"Other environmental or zero emission  initiatives\n•  yes= 2, no= 0",{"$f":"VLOOKUP(A226,Languages!$C$4:$I$273,1+'Languages Available'!$D$1)","v":223}]
[224,"Minus Points",{"$f":"VLOOKUP(A227,Languages!$C$4:$I$273,1+'Languages Available'!$D$1)","v":224}]
[225,"Presence of Graffiti",{"$f":"VLOOKUP(A228,Languages!$C$4:$I$273,1+'Languages Available'!$D$1)","v":225}]
[226,"Stairwells (Yes= -2, No= 0)",{"$f":"VLOOKUP(A229,Languages!$C$4:$I$273,1+'Languages Available'!$D$1)","v":226}]
[227,"Elevator (Yes= -2, No= 0)",{"$f":"VLOOKUP(A230,Languages!$C$4:$I$273,1+'Languages Available'!$D$1)","v":227}]
[228,"Toilets (Yes= -2, No= 0)",{"$f":"VLOOKUP(A231,Languages!$C$4:$I$273,1+'Languages Available'!$D$1)","v":228}]
[229,"Parking area (Yes= -2, No= 0)",{"$f":"VLOOKUP(A232,Languages!$C$4:$I$273,1+'Languages Available'!$D$1)","v":229}]
[230,"Outside walls (Yes= -2, No= 0)",{"$f":"VLOOKUP(A233,Languages!$C$4:$I$273,1+'Languages Available'!$D$1)","v":230}]
[231,"Presence of dirt",{"$f":"VLOOKUP(A234,Languages!$C$4:$I$273,1+'Languages Available'!$D$1)","v":231}]
[232,"Stairwells (Yes= -2, No= 0)",{"$f":"VLOOKUP(A235,Languages!$C$4:$I$273,1+'Languages Available'!$D$1)","v":232}]
[233,"Elevator (Yes= -2, No= 0)",{"$f":"VLOOKUP(A236,Languages!$C$4:$I$273,1+'Languages Available'!$D$1)","v":233}]
[234,"Toilets (Yes= -2, No= 0)",{"$f":"VLOOKUP(A237,Languages!$C$4:$I$273,1+'Languages Available'!$D$1)","v":234}]
[235,"Parking area (Yes= -2, No= 0)",{"$f":"VLOOKUP(A238,Languages!$C$4:$I$273,1+'Languages Available'!$D$1)","v":235}]
[236,"Outside of entrance for pedestrians + cars (Yes= -2, No= 0)",{"$f":"VLOOKUP(A239,Languages!$C$4:$I$273,1+'Languages Available'!$D$1)","v":236}]
[237,"Poor quality of paint work",{"$f":"VLOOKUP(A240,Languages!$C$4:$I$273,1+'Languages Available'!$D$1)","v":237}]
[238,"Stairwells (Yes= -2, No= 0)",{"$f":"VLOOKUP(A241,Languages!$C$4:$I$273,1+'Languages Available'!$D$1)","v":238}]
[239,"Elevator (Yes= -2, No= 0)",{"$f":"VLOOKUP(A242,Languages!$C$4:$I$273,1+'Languages Available'!$D$1)","v":239}]
[240,"Parking area (Yes= -2, No= 0)",{"$f":"VLOOKUP(A243,Languages!$C$4:$I$273,1+'Languages Available'!$D$1)","v":240}]
[241,"Poor quality horizontal markings (Yes= -2, No= 0)",{"$f":"VLOOKUP(A244,Languages!$C$4:$I$273,1+'Languages Available'!$D$1)","v":241}]
[242,"Poor quality/lack of maintenance (pot holes ,damages) ",{"$f":"VLOOKUP(A245,Languages!$C$4:$I$273,1+'Languages Available'!$D$1)","v":242}]
[243,"Floors (Yes= -2, No= 0)",{"$f":"VLOOKUP(A246,Languages!$C$4:$I$273,1+'Languages Available'!$D$1)","v":243}]
[244,"Walls (Yes= -2, No= 0)",{"$f":"VLOOKUP(A247,Languages!$C$4:$I$273,1+'Languages Available'!$D$1)","v":244}]
[245,"Evidence of standing water (Yes= -2, No= 0)",{"$f":"VLOOKUP(A248,Languages!$C$4:$I$273,1+'Languages Available'!$D$1)","v":245}]
[246,"Evidence of bad smells",{"$f":"VLOOKUP(A249,Languages!$C$4:$I$273,1+'Languages Available'!$D$1)","v":246}]
[247,"Elevators (Yes= -2, No= 0)",{"$f":"VLOOKUP(A250,Languages!$C$4:$I$273,1+'Languages Available'!$D$1)","v":247}]
[248,"Stairwells (Yes= -2, No= 0)",{"$f":"VLOOKUP(A251,Languages!$C$4:$I$273,1+'Languages Available'!$D$1)","v":248}]
[249,"Parking deck (Yes= -2, No= 0)",{"$f":"VLOOKUP(A252,Languages!$C$4:$I$273,1+'Languages Available'!$D$1)","v":249}]
[250,"Over 15% of parking spaces in cul-de-sac without occupancy indication. (Yes= -5, No=0)",{"$f":"VLOOKUP(A253,Languages!$C$4:$I$273,1+'Languages Available'!$D$1)","v":250}]
[251,"Various points of criticism (to explain!)\n[E.g. hollow sound, squeaking tyres, unintended visitors, etc.] up to -10",{"$f":"VLOOKUP(A254,Languages!$C$4:$I$273,1+'Languages Available'!$D$1)","v":251}]
[252,"Penalty for Mandatory Condition 1.4 Applies",{"$f":"VLOOKUP(A255,Languages!$C$4:$I$273,1+'Languages Available'!$D$1)","v":252}]
[253,"Bonus Points",{"$f":"VLOOKUP(A256,Languages!$C$4:$I$273,1+'Languages Available'!$D$1)","v":253}]
[254,"Extra provisions in car park",{"$f":"VLOOKUP(A257,Languages!$C$4:$I$273,1+'Languages Available'!$D$1)","v":254}]
[255,"Special motorcycle area (Yes= 1, No= 0)",{"$f":"VLOOKUP(A258,Languages!$C$4:$I$273,1+'Languages Available'!$D$1)","v":255}]
[256,"Lockers for customers’ use (Yes= 1, No= 0)",{"$f":"VLOOKUP(A259,Languages!$C$4:$I$273,1+'Languages Available'!$D$1)","v":256}]
[257,"Other aids (Yes= 1, No= 0)",{"$f":"VLOOKUP(A260,Languages!$C$4:$I$273,1+'Languages Available'!$D$1)","v":257}]
[258,"Bicycle rent (Yes= 1, No= 0)",{"$f":"VLOOKUP(A261,Languages!$C$4:$I$273,1+'Languages Available'!$D$1)","v":258}]
[{"$f":"A261+1","v":259},"Other Driver Assistance (Yes= 1, No= 0)",{"$f":"VLOOKUP(A262,Languages!$C$4:$I$273,1+'Languages Available'!$D$1)","v":259}]
[260,"Vending Machines (Yes= 1, No= 0)",{"$f":"VLOOKUP(A263,Languages!$C$4:$I$273,1+'Languages Available'!$D$1)","v":260}]
[261,"Heart Defibrillator (Yes= 1, No= 0)",{"$f":"VLOOKUP(A264,Languages!$C$4:$I$273,1+'Languages Available'!$D$1)","v":261}]
[262,"First aid trained staff (Yes= 1, No= 0)",{"$f":"VLOOKUP(A265,Languages!$C$4:$I$273,1+'Languages Available'!$D$1)","v":262}]
[263,"Real time traffic data (Yes= 1, No= 0)",{"$f":"VLOOKUP(A266,Languages!$C$4:$I$273,1+'Languages Available'!$D$1)","v":263}]
[264,"Other real time accessible information (e.g. local events) (Yes= 1, No= 0)",{"$f":"VLOOKUP(A267,Languages!$C$4:$I$273,1+'Languages Available'!$D$1)","v":264}]
[265,"Measures to avoid traffic queues at peak hours (i.e. tidal lane at car entry/exit) - (Yes= 3, No= 0)",{"$f":"VLOOKUP(A268,Languages!$C$4:$I$273,1+'Languages Available'!$D$1)","v":265}]
[266,"Turn around possibility for cars before height barrier or full sign to prevent reversing (Yes= 3, No= 0)",{"$f":"VLOOKUP(A269,Languages!$C$4:$I$273,1+'Languages Available'!$D$1)","v":266}]
[267,"Customer service desk (Yes= 1, No= 0)",{"$f":"VLOOKUP(A270,Languages!$C$4:$I$273,1+'Languages Available'!$D$1)","v":267}]
[268,"Escalators and/or travellators\n(To/from all levels =5, To/from some levels =3, No Escalators or Travellators = 0)",{"$f":"VLOOKUP(A271,Languages!$C$4:$I$273,1+'Languages Available'!$D$1)","v":268}]
[269,"Localisation of parked cars by ticket or license plate\n(Yes= 1, No= 0)",{"$f":"VLOOKUP(A272,Languages!$C$4:$I$273,1+'Languages Available'!$D$1)","v":269}]
[270,"Other positive points e.g. extra services, friendly staff, tiled walls/floors, good fit of the car park in cityscape etc up to ten additional bonus points. To be explicitly identified.",{"$f":"VLOOKUP(A273,Languages!$C$4:$I$273,1+'Languages Available'!$D$1)","v":270}]
[]
[null,"Tags","Tags"]
[1,"Date",{"$f":"VLOOKUP(A276,Tags!$C$4:$I$80,1+'Languages Available'!$D$1)","v":1}]
[2,"Language",{"$f":"VLOOKUP(A277,Tags!$C$4:$I$80,1+'Languages Available'!$D$1)","v":2}]
[3,"Country",{"$f":"VLOOKUP(A278,Tags!$C$4:$I$80,1+'Languages Available'!$D$1)","v":3}]
[4,"Name of Car Park",{"$f":"VLOOKUP(A279,Tags!$C$4:$I$80,1+'Languages Available'!$D$1)","v":4}]
[5,"Address",{"$f":"VLOOKUP(A280,Tags!$C$4:$I$80,1+'Languages Available'!$D$1)","v":5}]
[6,"City",{"$f":"VLOOKUP(A281,Tags!$C$4:$I$80,1+'Languages Available'!$D$1)","v":6}]
[7,"Number of Spaces",{"$f":"VLOOKUP(A282,Tags!$C$4:$I$80,1+'Languages Available'!$D$1)","v":7}]
[8,"Operator",{"$f":"VLOOKUP(A283,Tags!$C$4:$I$80,1+'Languages Available'!$D$1)","v":8}]
[9,"Contact Name",{"$f":"VLOOKUP(A284,Tags!$C$4:$I$80,1+'Languages Available'!$D$1)","v":9}]
[10,"e-Mail",{"$f":"VLOOKUP(A285,Tags!$C$4:$I$80,1+'Languages Available'!$D$1)","v":10}]
[11,"Phone",{"$f":"VLOOKUP(A286,Tags!$C$4:$I$80,1+'Languages Available'!$D$1)","v":11}]
[12,"Judged by",{"$f":"VLOOKUP(A287,Tags!$C$4:$I$80,1+'Languages Available'!$D$1)","v":12}]
[13,"Evaluation Conditions",{"$f":"VLOOKUP(A288,Tags!$C$4:$I$80,1+'Languages Available'!$D$1)","v":13}]
[14,"Time of Day",{"$f":"VLOOKUP(A289,Tags!$C$4:$I$80,1+'Languages Available'!$D$1)","v":14}]
[15,"Weather Conditions",{"$f":"VLOOKUP(A290,Tags!$C$4:$I$80,1+'Languages Available'!$D$1)","v":15}]
[16,"Occupancy Rate",{"$f":"VLOOKUP(A291,Tags!$C$4:$I$80,1+'Languages Available'!$D$1)","v":16}]
[17,"Completed",{"$f":"VLOOKUP(A292,Tags!$C$4:$I$80,1+'Languages Available'!$D$1)","v":17}]
[18,"Incompleted",{"$f":"VLOOKUP(A293,Tags!$C$4:$I$80,1+'Languages Available'!$D$1)","v":18}]
[19,"Compliant",{"$f":"VLOOKUP(A294,Tags!$C$4:$I$80,1+'Languages Available'!$D$1)","v":19}]
[20,"Comments",{"$f":"VLOOKUP(A295,Tags!$C$4:$I$80,1+'Languages Available'!$D$1)","v":20}]
[21,"Number of Ok:",{"$f":"VLOOKUP(A296,Tags!$C$4:$I$80,1+'Languages Available'!$D$1)","v":21}]
[22,"Number of Fails:",{"$f":"VLOOKUP(A297,Tags!$C$4:$I$80,1+'Languages Available'!$D$1)","v":22}]
[23,"Not Evaluated:",{"$f":"VLOOKUP(A298,Tags!$C$4:$I$80,1+'Languages Available'!$D$1)","v":23}]
[24,"Pass",{"$f":"VLOOKUP(A299,Tags!$C$4:$I$80,1+'Languages Available'!$D$1)","v":24}]
[25,"Fail",{"$f":"VLOOKUP(A300,Tags!$C$4:$I$80,1+'Languages Available'!$D$1)","v":25}]
[26,"Incomplete",{"$f":"VLOOKUP(A301,Tags!$C$4:$I$80,1+'Languages Available'!$D$1)","v":26}]
[27,"Total Items",{"$f":"VLOOKUP(A302,Tags!$C$4:$I$80,1+'Languages Available'!$D$1)","v":27}]
[28,"Total Items + SubItems",{"$f":"VLOOKUP(A303,Tags!$C$4:$I$80,1+'Languages Available'!$D$1)","v":28}]
[29,"Itens Completed",{"$f":"VLOOKUP(A304,Tags!$C$4:$I$80,1+'Languages Available'!$D$1)","v":29}]
[30,"Not measured",{"$f":"VLOOKUP(A305,Tags!$C$4:$I$80,1+'Languages Available'!$D$1)","v":30}]
[31,"Score",{"$f":"VLOOKUP(A306,Tags!$C$4:$I$80,1+'Languages Available'!$D$1)","v":31}]
[32,"Maximum Score",{"$f":"VLOOKUP(A307,Tags!$C$4:$I$80,1+'Languages Available'!$D$1)","v":32}]
[33,"Percentage",{"$f":"VLOOKUP(A308,Tags!$C$4:$I$80,1+'Languages Available'!$D$1)","v":33}]
[34,"Category Value",{"$f":"VLOOKUP(A309,Tags!$C$4:$I$80,1+'Languages Available'!$D$1)","v":34}]
[35,"Global Evaluation",{"$f":"VLOOKUP(A310,Tags!$C$4:$I$80,1+'Languages Available'!$D$1)","v":35}]
[36,"Category",{"$f":"VLOOKUP(A311,Tags!$C$4:$I$80,1+'Languages Available'!$D$1)","v":36}]
[37,"Number of Items",{"$f":"VLOOKUP(A312,Tags!$C$4:$I$80,1+'Languages Available'!$D$1)","v":37}]
[38,"Number of Oks",{"$f":"VLOOKUP(A313,Tags!$C$4:$I$80,1+'Languages Available'!$D$1)","v":38}]
[39,"Number of Fails",{"$f":"VLOOKUP(A314,Tags!$C$4:$I$80,1+'Languages Available'!$D$1)","v":39}]
[40,"To be Completed",{"$f":"VLOOKUP(A315,Tags!$C$4:$I$80,1+'Languages Available'!$D$1)","v":40}]
[41,"% Obtained",{"$f":"VLOOKUP(A316,Tags!$C$4:$I$80,1+'Languages Available'!$D$1)","v":41}]
[42,"Minimum",{"$f":"VLOOKUP(A317,Tags!$C$4:$I$80,1+'Languages Available'!$D$1)","v":42}]
[43,"Category Points",{"$f":"VLOOKUP(A318,Tags!$C$4:$I$80,1+'Languages Available'!$D$1)","v":43}]
[44,"Points Obtained",{"$f":"VLOOKUP(A319,Tags!$C$4:$I$80,1+'Languages Available'!$D$1)","v":44}]
[45,"Status",{"$f":"VLOOKUP(A320,Tags!$C$4:$I$80,1+'Languages Available'!$D$1)","v":45}]
[46,"% Completion:",{"$f":"VLOOKUP(A321,Tags!$C$4:$I$80,1+'Languages Available'!$D$1)","v":46}]
[47,"Subtotals",{"$f":"VLOOKUP(A322,Tags!$C$4:$I$80,1+'Languages Available'!$D$1)","v":47}]
[48,"Totals",{"$f":"VLOOKUP(A323,Tags!$C$4:$I$80,1+'Languages Available'!$D$1)","v":48}]
[49,"Minimum Requirement for ESPA Award",{"$f":"VLOOKUP(A324,Tags!$C$4:$I$80,1+'Languages Available'!$D$1)","v":49}]
[50,"Categories Minimum Points",{"$f":"VLOOKUP(A325,Tags!$C$4:$I$80,1+'Languages Available'!$D$1)","v":50}]
[51,"Espa Award",{"$f":"VLOOKUP(A326,Tags!$C$4:$I$80,1+'Languages Available'!$D$1)","v":51}]
[52,"Item List",{"$f":"VLOOKUP(A327,Tags!$C$4:$I$80,1+'Languages Available'!$D$1)","v":52}]
[53,"Measured value",{"$f":"VLOOKUP(A328,Tags!$C$4:$I$80,1+'Languages Available'!$D$1)","v":53}]
[54,"Maximum Contribuition for Final Score",{"$f":"VLOOKUP(A329,Tags!$C$4:$I$80,1+'Languages Available'!$D$1)","v":54}]
[55,"Contribuition for Final Score",{"$f":"VLOOKUP(A330,Tags!$C$4:$I$80,1+'Languages Available'!$D$1)","v":55}]
[56,"Remarks",{"$f":"VLOOKUP(A331,Tags!$C$4:$I$80,1+'Languages Available'!$D$1)","v":56}]
[57,"Notes",{"$f":"VLOOKUP(A332,Tags!$C$4:$I$80,1+'Languages Available'!$D$1)","v":57}]
[58,"This will erase all data in ESPA Worksheet. Are you sure?",{"$f":"VLOOKUP(A333,Tags!$C$4:$I$80,1+'Languages Available'!$D$1)","v":58}]
[59,"You have entered an incorrect password. ESPA Worksheets could not be umprotected.",{"$f":"VLOOKUP(A334,Tags!$C$4:$I$80,1+'Languages Available'!$D$1)","v":59}]
[60,"Please enter your password to umprotect ESPA Worksheet:",{"$f":"VLOOKUP(A335,Tags!$C$4:$I$80,1+'Languages Available'!$D$1)","v":60}]
[61,"Password Input",{"$f":"VLOOKUP(A336,Tags!$C$4:$I$80,1+'Languages Available'!$D$1)","v":61}]
[62,"Incorrect Password",{"$f":"VLOOKUP(A337,Tags!$C$4:$I$80,1+'Languages Available'!$D$1)","v":62}]
[63,"This will print 15 pages on your active printer. Are you sure?",{"$f":"VLOOKUP(A338,Tags!$C$4:$I$80,1+'Languages Available'!$D$1)","v":63}]
[64,"Alert",{"$f":"VLOOKUP(A339,Tags!$C$4:$I$80,1+'Languages Available'!$D$1)","v":64}]
[65,"Changing languge will reset al your previous answers. Do you want to proceed?",{"$f":"VLOOKUP(A340,Tags!$C$4:$I$80,1+'Languages Available'!$D$1)","v":65}]
[66,"Mandatory Conditions for Golden Award",{"$f":"VLOOKUP(A341,Tags!$C$4:$I$80,1+'Languages Available'!$D$1)","v":66}]
[67,"ESPA Gold Award",{"$f":"VLOOKUP(A342,Tags!$C$4:$I$80,1+'Languages Available'!$D$1)","v":67}]
[68,"Global Evaluation - Gold Award",{"$f":"VLOOKUP(A343,Tags!$C$4:$I$80,1+'Languages Available'!$D$1)","v":68}]
[69,"The ESPA Worksheet uses Macros. Please enable content or close and reopen with Macros Enabled",{"$f":"VLOOKUP(A344,Tags!$C$4:$I$80,1+'Languages Available'!$D$1)","v":69}]
[70,"Year of Construction",{"$f":"VLOOKUP(A345,Tags!$C$4:$I$80,1+'Languages Available'!$D$1)","v":70}]
[71,"Structure",{"$f":"VLOOKUP(A346,Tags!$C$4:$I$80,1+'Languages Available'!$D$1)","v":71}]
[72,"Type",{"$f":"VLOOKUP(A347,Tags!$C$4:$I$80,1+'Languages Available'!$D$1)","v":72}]
[73,"Access Control System",{"$f":"VLOOKUP(A348,Tags!$C$4:$I$80,1+'Languages Available'!$D$1)","v":73}]
[74,"Number of Lifts",{"$f":"VLOOKUP(A349,Tags!$C$4:$I$80,1+'Languages Available'!$D$1)","v":74}]
[75,"Number of Floors",{"$f":"VLOOKUP(A350,Tags!$C$4:$I$80,1+'Languages Available'!$D$1)","v":75}]
[76,"Car Park Main Characteristics",{"$f":"VLOOKUP(A351,Tags!$C$4:$I$80,1+'Languages Available'!$D$1)","v":76}]
[]
[null,"Options","Options"]
[1,"Morning",{"$f":"VLOOKUP(A354,Options!$C$4:$I$235,1+'Languages Available'!$D$1)","v":1}]
[{"$f":"+A354+1","v":2},"Afternoon",{"$f":"VLOOKUP(A355,Options!$C$4:$I$235,1+'Languages Available'!$D$1)","v":2}]
[{"$f":"+A355+1","v":3},"Evening",{"$f":"VLOOKUP(A356,Options!$C$4:$I$235,1+'Languages Available'!$D$1)","v":3}]
[4]
[5,"Sunny",{"$f":"VLOOKUP(A358,Options!$C$4:$I$235,1+'Languages Available'!$D$1)","v":5}]
[6,"Cloudy",{"$f":"VLOOKUP(A359,Options!$C$4:$I$235,1+'Languages Available'!$D$1)","v":6}]
[7,"Rain",{"$f":"VLOOKUP(A360,Options!$C$4:$I$235,1+'Languages Available'!$D$1)","v":7}]
[8,"Dusk",{"$f":"VLOOKUP(A361,Options!$C$4:$I$235,1+'Languages Available'!$D$1)","v":8}]
[9,"Night",{"$f":"VLOOKUP(A362,Options!$C$4:$I$235,1+'Languages Available'!$D$1)","v":9}]
[10]
[11," > 75%",{"$f":"VLOOKUP(A364,Options!$C$4:$I$235,1+'Languages Available'!$D$1)","v":11}]
[12," 50% - 75%",{"$f":"VLOOKUP(A365,Options!$C$4:$I$235,1+'Languages Available'!$D$1)","v":12}]
[13," about 50%",{"$f":"VLOOKUP(A366,Options!$C$4:$I$235,1+'Languages Available'!$D$1)","v":13}]
[14," 25% - 50%  ",{"$f":"VLOOKUP(A367,Options!$C$4:$I$235,1+'Languages Available'!$D$1)","v":14}]
[15,"< 25%",{"$f":"VLOOKUP(A368,Options!$C$4:$I$235,1+'Languages Available'!$D$1)","v":15}]
[16]
[17,"OK",{"$f":"VLOOKUP(A370,Options!$C$4:$I$235,1+'Languages Available'!$D$1)","v":17}]
[18,"Fail",{"$f":"VLOOKUP(A371,Options!$C$4:$I$235,1+'Languages Available'!$D$1)","v":18}]
[19]
[20,"Yes",{"$f":"VLOOKUP(A373,Options!$C$4:$I$235,1+'Languages Available'!$D$1)","v":20}]
[21,"No",{"$f":"VLOOKUP(A374,Options!$C$4:$I$235,1+'Languages Available'!$D$1)","v":21}]
[22,"Irrelevant",{"$f":"VLOOKUP(A375,Options!$C$4:$I$235,1+'Languages Available'!$D$1)","v":22}]
[23,"Clear signing",{"$f":"VLOOKUP(A376,Options!$C$4:$I$235,1+'Languages Available'!$D$1)","v":23}]
[24,"Incomplete signing",{"$f":"VLOOKUP(A377,Options!$C$4:$I$235,1+'Languages Available'!$D$1)","v":24}]
[25,"No signing",{"$f":"VLOOKUP(A378,Options!$C$4:$I$235,1+'Languages Available'!$D$1)","v":25}]
[26]
[27,"0%-2%",{"$f":"VLOOKUP(A380,Options!$C$4:$I$235,1+'Languages Available'!$D$1)","v":27}]
[28,"2%-5%",{"$f":"VLOOKUP(A381,Options!$C$4:$I$235,1+'Languages Available'!$D$1)","v":28}]
[29,"Above 5%",{"$f":"VLOOKUP(A382,Options!$C$4:$I$235,1+'Languages Available'!$D$1)","v":29}]
[30]
[31,"Yes ",{"$f":"VLOOKUP(A384,Options!$C$4:$I$235,1+'Languages Available'!$D$1)","v":31}]
[32,"No protection",{"$f":"VLOOKUP(A385,Options!$C$4:$I$235,1+'Languages Available'!$D$1)","v":32}]
[33,"No kerbs in entry/exit area",{"$f":"VLOOKUP(A386,Options!$C$4:$I$235,1+'Languages Available'!$D$1)","v":33}]
[34]
[35,"Anti slip",{"$f":"VLOOKUP(A388,Options!$C$4:$I$235,1+'Languages Available'!$D$1)","v":35}]
[36,"Slippery when wet",{"$f":"VLOOKUP(A389,Options!$C$4:$I$235,1+'Languages Available'!$D$1)","v":36}]
[37]
[38,"< 3 m",{"$f":"VLOOKUP(A391,Options!$C$4:$I$235,1+'Languages Available'!$D$1)","v":38}]
[39,"3m – 3.3m",{"$f":"VLOOKUP(A392,Options!$C$4:$I$235,1+'Languages Available'!$D$1)","v":39}]
[40,"> 3.3m",{"$f":"VLOOKUP(A393,Options!$C$4:$I$235,1+'Languages Available'!$D$1)","v":40}]
[41]
[42,"Pillar does not intrude into the parking area",{"$f":"VLOOKUP(A395,Options!$C$4:$I$235,1+'Languages Available'!$D$1)","v":42}]
[43,"Pillar at beginning of stall",{"$f":"VLOOKUP(A396,Options!$C$4:$I$235,1+'Languages Available'!$D$1)","v":43}]
[44,"Pillar next to car door",{"$f":"VLOOKUP(A397,Options!$C$4:$I$235,1+'Languages Available'!$D$1)","v":44}]
[45,"Pillar at back of stall but intrudes into the parking area",{"$f":"VLOOKUP(A398,Options!$C$4:$I$235,1+'Languages Available'!$D$1)","v":45}]
[46]
[47,"Good",{"$f":"VLOOKUP(A400,Options!$C$4:$I$235,1+'Languages Available'!$D$1)","v":47}]
[48,"Medium",{"$f":"VLOOKUP(A401,Options!$C$4:$I$235,1+'Languages Available'!$D$1)","v":48}]
[49,"Bad",{"$f":"VLOOKUP(A402,Options!$C$4:$I$235,1+'Languages Available'!$D$1)","v":49}]
[50]
[51,"Angle 76°-90°",{"$f":"VLOOKUP(A404,Options!$C$4:$I$235,1+'Languages Available'!$D$1)","v":51}]
[52,"Angle  45°-75°",{"$f":"VLOOKUP(A405,Options!$C$4:$I$235,1+'Languages Available'!$D$1)","v":52}]
[53,null,{"$f":"VLOOKUP(A406,Options!$C$4:$I$235,1+'Languages Available'!$D$1)","v":53}]
[54," 2.25 m - 2.30 m",{"$f":"VLOOKUP(A407,Options!$C$4:$I$235,1+'Languages Available'!$D$1)","v":54}]
[55," 2.30 m - 2.35 m",{"$f":"VLOOKUP(A408,Options!$C$4:$I$235,1+'Languages Available'!$D$1)","v":55}]
[56," 2.35 m - 2.40 m",{"$f":"VLOOKUP(A409,Options!$C$4:$I$235,1+'Languages Available'!$D$1)","v":56}]
[57," 2.40 m - 2.45 m",{"$f":"VLOOKUP(A410,Options!$C$4:$I$235,1+'Languages Available'!$D$1)","v":57}]
[58," 2.45 m - 2.50 m",{"$f":"VLOOKUP(A411,Options!$C$4:$I$235,1+'Languages Available'!$D$1)","v":58}]
[59," above 2.50 m",{"$f":"VLOOKUP(A412,Options!$C$4:$I$235,1+'Languages Available'!$D$1)","v":59}]
[60]
[61,"Compliant with the table",{"$f":"VLOOKUP(A414,Options!$C$4:$I$235,1+'Languages Available'!$D$1)","v":61}]
[62,"Up to 30 cm less",{"$f":"VLOOKUP(A415,Options!$C$4:$I$235,1+'Languages Available'!$D$1)","v":62}]
[63,"Up to 60 cm less",{"$f":"VLOOKUP(A416,Options!$C$4:$I$235,1+'Languages Available'!$D$1)","v":63}]
[64,"More than 60 cm less",{"$f":"VLOOKUP(A417,Options!$C$4:$I$235,1+'Languages Available'!$D$1)","v":64}]
[65]
[66,"Anti-Slip",{"$f":"VLOOKUP(A419,Options!$C$4:$I$235,1+'Languages Available'!$D$1)","v":66}]
[{"$f":"+A419+1","v":67},"Smooth",{"$f":"VLOOKUP(A420,Options!$C$4:$I$235,1+'Languages Available'!$D$1)","v":67}]
[68,"No Ramps",{"$f":"VLOOKUP(A421,Options!$C$4:$I$235,1+'Languages Available'!$D$1)","v":68}]
[69]
[70,"< 2.00m",{"$f":"VLOOKUP(A423,Options!$C$4:$I$235,1+'Languages Available'!$D$1)","v":70}]
[71,"2.00m – 2.10m",{"$f":"VLOOKUP(A424,Options!$C$4:$I$235,1+'Languages Available'!$D$1)","v":71}]
[72,"2.10m – 2.20m",{"$f":"VLOOKUP(A425,Options!$C$4:$I$235,1+'Languages Available'!$D$1)","v":72}]
[73,"> 2.20m",{"$f":"VLOOKUP(A426,Options!$C$4:$I$235,1+'Languages Available'!$D$1)","v":73}]
[74]
[75,"Yes (automatic or open connection)",{"$f":"VLOOKUP(A428,Options!$C$4:$I$235,1+'Languages Available'!$D$1)","v":75}]
[76,"Easy to Open",{"$f":"VLOOKUP(A429,Options!$C$4:$I$235,1+'Languages Available'!$D$1)","v":76}]
[77,"No",{"$f":"VLOOKUP(A430,Options!$C$4:$I$235,1+'Languages Available'!$D$1)","v":77}]
[78]
[79,"Every pedestrian exit",{"$f":"VLOOKUP(A432,Options!$C$4:$I$235,1+'Languages Available'!$D$1)","v":79}]
[80,"One location",{"$f":"VLOOKUP(A433,Options!$C$4:$I$235,1+'Languages Available'!$D$1)","v":80}]
[81,"No",{"$f":"VLOOKUP(A434,Options!$C$4:$I$235,1+'Languages Available'!$D$1)","v":81}]
[82]
[83,"One elevator",{"$f":"VLOOKUP(A436,Options!$C$4:$I$235,1+'Languages Available'!$D$1)","v":83}]
[84,"Two or more elevators",{"$f":"VLOOKUP(A437,Options!$C$4:$I$235,1+'Languages Available'!$D$1)","v":84}]
[85]
[86,"More Than 8 People",{"$f":"VLOOKUP(A439,Options!$C$4:$I$235,1+'Languages Available'!$D$1)","v":86}]
[87,"4 to 8 people",{"$f":"VLOOKUP(A440,Options!$C$4:$I$235,1+'Languages Available'!$D$1)","v":87}]
[88,"Less Than 4",{"$f":"VLOOKUP(A441,Options!$C$4:$I$235,1+'Languages Available'!$D$1)","v":88}]
[89]
[90,"no visibility from elevator",{"$f":"VLOOKUP(A443,Options!$C$4:$I$235,1+'Languages Available'!$D$1)","v":90}]
[91,"glazed doors/walls",{"$f":"VLOOKUP(A444,Options!$C$4:$I$235,1+'Languages Available'!$D$1)","v":91}]
[92,"no elevator",{"$f":"VLOOKUP(A445,Options!$C$4:$I$235,1+'Languages Available'!$D$1)","v":92}]
[93]
[94,"< 1.5 m",{"$f":"VLOOKUP(A447,Options!$C$4:$I$235,1+'Languages Available'!$D$1)","v":94}]
[95,"> 1.5 m",{"$f":"VLOOKUP(A448,Options!$C$4:$I$235,1+'Languages Available'!$D$1)","v":95}]
[96]
[97,"< 90 cm",{"$f":"VLOOKUP(A450,Options!$C$4:$I$235,1+'Languages Available'!$D$1)","v":97}]
[98,">= 90 cm",{"$f":"VLOOKUP(A451,Options!$C$4:$I$235,1+'Languages Available'!$D$1)","v":98}]
[99]
[100,"Glazed door/wall",{"$f":"VLOOKUP(A453,Options!$C$4:$I$235,1+'Languages Available'!$D$1)","v":100}]
[101,"No Glass",{"$f":"VLOOKUP(A454,Options!$C$4:$I$235,1+'Languages Available'!$D$1)","v":101}]
[102]
[103,"No hand rail",{"$f":"VLOOKUP(A456,Options!$C$4:$I$235,1+'Languages Available'!$D$1)","v":103}]
[104,"One Side",{"$f":"VLOOKUP(A457,Options!$C$4:$I$235,1+'Languages Available'!$D$1)","v":104}]
[105,"Two sides",{"$f":"VLOOKUP(A458,Options!$C$4:$I$235,1+'Languages Available'!$D$1)","v":105}]
[106]
[107,"window/grilled",{"$f":"VLOOKUP(A460,Options!$C$4:$I$235,1+'Languages Available'!$D$1)","v":107}]
[108,"none",{"$f":"VLOOKUP(A461,Options!$C$4:$I$235,1+'Languages Available'!$D$1)","v":108}]
[109]
[110,"24*7",{"$f":"VLOOKUP(A463,Options!$C$4:$I$235,1+'Languages Available'!$D$1)","v":110}]
[111,"All access hours if not 24*7",{"$f":"VLOOKUP(A464,Options!$C$4:$I$235,1+'Languages Available'!$D$1)","v":111}]
[112,"Part time/not available",{"$f":"VLOOKUP(A465,Options!$C$4:$I$235,1+'Languages Available'!$D$1)","v":112}]
[113]
[114,"24*7",{"$f":"VLOOKUP(A467,Options!$C$4:$I$235,1+'Languages Available'!$D$1)","v":114}]
[115,"During access Hours",{"$f":"VLOOKUP(A468,Options!$C$4:$I$235,1+'Languages Available'!$D$1)","v":115}]
[116,"Less than access Hours",{"$f":"VLOOKUP(A469,Options!$C$4:$I$235,1+'Languages Available'!$D$1)","v":116}]
[117,"No",{"$f":"VLOOKUP(A470,Options!$C$4:$I$235,1+'Languages Available'!$D$1)","v":117}]
[118]
[119,"Closed gate/rolling shutter  after access hours",{"$f":"VLOOKUP(A472,Options!$C$4:$I$235,1+'Languages Available'!$D$1)","v":119}]
[120,"Secured: fast opening gate during day",{"$f":"VLOOKUP(A473,Options!$C$4:$I$235,1+'Languages Available'!$D$1)","v":120}]
[121,"Secured: slow opening gate during day",{"$f":"VLOOKUP(A474,Options!$C$4:$I$235,1+'Languages Available'!$D$1)","v":121}]
[122,"No provisions",{"$f":"VLOOKUP(A475,Options!$C$4:$I$235,1+'Languages Available'!$D$1)","v":122}]
[123]
[124,"Maximum Aperture Door/gate/rolling shutter <= 15cm",{"$f":"VLOOKUP(A477,Options!$C$4:$I$235,1+'Languages Available'!$D$1)","v":124}]
[125,"Maximum Aperture Door/gate/rolling shutter > 15cm",{"$f":"VLOOKUP(A478,Options!$C$4:$I$235,1+'Languages Available'!$D$1)","v":125}]
[126,"no provisions",{"$f":"VLOOKUP(A479,Options!$C$4:$I$235,1+'Languages Available'!$D$1)","v":126}]
[127,"Irrelevant (24 hours opening)",{"$f":"VLOOKUP(A480,Options!$C$4:$I$235,1+'Languages Available'!$D$1)","v":127}]
[128]
[129,"<= 15 cm",{"$f":"VLOOKUP(A482,Options!$C$4:$I$235,1+'Languages Available'!$D$1)","v":129}]
[130,">15 cm or no protection",{"$f":"VLOOKUP(A483,Options!$C$4:$I$235,1+'Languages Available'!$D$1)","v":130}]
[{"$f":"+A483+1","v":131},"Irrelevant (no external openings)",{"$f":"VLOOKUP(A484,Options!$C$4:$I$235,1+'Languages Available'!$D$1)","v":131}]
[132]
[133,"Yes/Good",{"$f":"VLOOKUP(A486,Options!$C$4:$I$235,1+'Languages Available'!$D$1)","v":133}]
[134,"No/Bad",{"$f":"VLOOKUP(A487,Options!$C$4:$I$235,1+'Languages Available'!$D$1)","v":134}]
[135]
[136,"Good",{"$f":"VLOOKUP(A489,Options!$C$4:$I$235,1+'Languages Available'!$D$1)","v":136}]
[137,"Adequate",{"$f":"VLOOKUP(A490,Options!$C$4:$I$235,1+'Languages Available'!$D$1)","v":137}]
[138,"Poor",{"$f":"VLOOKUP(A491,Options!$C$4:$I$235,1+'Languages Available'!$D$1)","v":138}]
[139,"No",{"$f":"VLOOKUP(A492,Options!$C$4:$I$235,1+'Languages Available'!$D$1)","v":139}]
[140]
[141,"Clear from all locations",{"$f":"VLOOKUP(A494,Options!$C$4:$I$235,1+'Languages Available'!$D$1)","v":141}]
[142,"Clear from most locations",{"$f":"VLOOKUP(A495,Options!$C$4:$I$235,1+'Languages Available'!$D$1)","v":142}]
[143,"Clear from some locations",{"$f":"VLOOKUP(A496,Options!$C$4:$I$235,1+'Languages Available'!$D$1)","v":143}]
[144,"No marking of escape routes",{"$f":"VLOOKUP(A497,Options!$C$4:$I$235,1+'Languages Available'!$D$1)","v":144}]
[145]
[146,"Good",{"$f":"VLOOKUP(A499,Options!$C$4:$I$235,1+'Languages Available'!$D$1)","v":146}]
[147,"Adequate",{"$f":"VLOOKUP(A500,Options!$C$4:$I$235,1+'Languages Available'!$D$1)","v":147}]
[148,"Poor",{"$f":"VLOOKUP(A501,Options!$C$4:$I$235,1+'Languages Available'!$D$1)","v":148}]
[149,"None",{"$f":"VLOOKUP(A502,Options!$C$4:$I$235,1+'Languages Available'!$D$1)","v":149}]
[150,"Single Level Car Park",{"$f":"VLOOKUP(A503,Options!$C$4:$I$235,1+'Languages Available'!$D$1)","v":150}]
[151]
[152,"Good",{"$f":"VLOOKUP(A505,Options!$C$4:$I$235,1+'Languages Available'!$D$1)","v":152}]
[153,"Some",{"$f":"VLOOKUP(A506,Options!$C$4:$I$235,1+'Languages Available'!$D$1)","v":153}]
[154,"None",{"$f":"VLOOKUP(A507,Options!$C$4:$I$235,1+'Languages Available'!$D$1)","v":154}]
[155]
[156,"Numbered including floor identification",{"$f":"VLOOKUP(A509,Options!$C$4:$I$235,1+'Languages Available'!$D$1)","v":156}]
[157,"Just numbers",{"$f":"VLOOKUP(A510,Options!$C$4:$I$235,1+'Languages Available'!$D$1)","v":157}]
[158,"None",{"$f":"VLOOKUP(A511,Options!$C$4:$I$235,1+'Languages Available'!$D$1)","v":158}]
[159]
[160,"Zero",{"$f":"VLOOKUP(A513,Options!$C$4:$I$235,1+'Languages Available'!$D$1)","v":160}]
[161,"One",{"$f":"VLOOKUP(A514,Options!$C$4:$I$235,1+'Languages Available'!$D$1)","v":161}]
[162,"Two",{"$f":"VLOOKUP(A515,Options!$C$4:$I$235,1+'Languages Available'!$D$1)","v":162}]
[163,"Three or More",{"$f":"VLOOKUP(A516,Options!$C$4:$I$235,1+'Languages Available'!$D$1)","v":163}]
[164]
[165,"One pay station",{"$f":"VLOOKUP(A518,Options!$C$4:$I$235,1+'Languages Available'!$D$1)","v":165}]
[166,"More than one",{"$f":"VLOOKUP(A519,Options!$C$4:$I$235,1+'Languages Available'!$D$1)","v":166}]
[167,"One at each pedestrian entrance",{"$f":"VLOOKUP(A520,Options!$C$4:$I$235,1+'Languages Available'!$D$1)","v":167}]
[168,"More than one at each pedestrian entrance",{"$f":"VLOOKUP(A521,Options!$C$4:$I$235,1+'Languages Available'!$D$1)","v":168}]
[169]
[170,"One",{"$f":"VLOOKUP(A523,Options!$C$4:$I$235,1+'Languages Available'!$D$1)","v":170}]
[171,"< 1 for every 50 spaces",{"$f":"VLOOKUP(A524,Options!$C$4:$I$235,1+'Languages Available'!$D$1)","v":171}]
[172,">1 for every 50 spaces",{"$f":"VLOOKUP(A525,Options!$C$4:$I$235,1+'Languages Available'!$D$1)","v":172}]
[173]
[174,"Unisex",{"$f":"VLOOKUP(A527,Options!$C$4:$I$235,1+'Languages Available'!$D$1)","v":174}]
[175,"Male/Female Separated",{"$f":"VLOOKUP(A528,Options!$C$4:$I$235,1+'Languages Available'!$D$1)","v":175}]
[176]
[177,"Coloured pillars",{"$f":"VLOOKUP(A530,Options!$C$4:$I$235,1+'Languages Available'!$D$1)","v":177}]
[178,"No/Concrete grey",{"$f":"VLOOKUP(A531,Options!$C$4:$I$235,1+'Languages Available'!$D$1)","v":178}]
[179]
[180,"Coloured walls",{"$f":"VLOOKUP(A533,Options!$C$4:$I$235,1+'Languages Available'!$D$1)","v":180}]
[181,"No/Concrete grey",{"$f":"VLOOKUP(A534,Options!$C$4:$I$235,1+'Languages Available'!$D$1)","v":181}]
[182]
[183,"More than one recharging point",{"$f":"VLOOKUP(A536,Options!$C$4:$I$235,1+'Languages Available'!$D$1)","v":183}]
[184,"One recharging point",{"$f":"VLOOKUP(A537,Options!$C$4:$I$235,1+'Languages Available'!$D$1)","v":184}]
[185,"None",{"$f":"VLOOKUP(A538,Options!$C$4:$I$235,1+'Languages Available'!$D$1)","v":185}]
[186]
[187,"To/from all levels",{"$f":"VLOOKUP(A540,Options!$C$4:$I$235,1+'Languages Available'!$D$1)","v":187}]
[188,"To/from some levels",{"$f":"VLOOKUP(A541,Options!$C$4:$I$235,1+'Languages Available'!$D$1)","v":188}]
[189,"No Escalators or Travellator",{"$f":"VLOOKUP(A542,Options!$C$4:$I$235,1+'Languages Available'!$D$1)","v":189}]
[190]
[191," <10%",{"$f":"VLOOKUP(A544,Options!$C$4:$I$235,1+'Languages Available'!$D$1)","v":191}]
[192," 10-15%",{"$f":"VLOOKUP(A545,Options!$C$4:$I$235,1+'Languages Available'!$D$1)","v":192}]
[193,">15%",{"$f":"VLOOKUP(A546,Options!$C$4:$I$235,1+'Languages Available'!$D$1)","v":193}]
[194,"no ramps",{"$f":"VLOOKUP(A547,Options!$C$4:$I$235,1+'Languages Available'!$D$1)","v":194}]
[{"$f":"+A547+1","v":195}]
[196,"< 3m",{"$f":"VLOOKUP(A549,Options!$C$4:$I$235,1+'Languages Available'!$D$1)","v":196}]
[197,"3m - 3.3m",{"$f":"VLOOKUP(A550,Options!$C$4:$I$235,1+'Languages Available'!$D$1)","v":197}]
[198,">3.3m",{"$f":"VLOOKUP(A551,Options!$C$4:$I$235,1+'Languages Available'!$D$1)","v":198}]
[199,"no ramps",{"$f":"VLOOKUP(A552,Options!$C$4:$I$235,1+'Languages Available'!$D$1)","v":199}]
[200]
[201,"< 4m",{"$f":"VLOOKUP(A554,Options!$C$4:$I$235,1+'Languages Available'!$D$1)","v":201}]
[202,"4m - 4.3m",{"$f":"VLOOKUP(A555,Options!$C$4:$I$235,1+'Languages Available'!$D$1)","v":202}]
[203,">4.3m",{"$f":"VLOOKUP(A556,Options!$C$4:$I$235,1+'Languages Available'!$D$1)","v":203}]
[204,"no ramps",{"$f":"VLOOKUP(A557,Options!$C$4:$I$235,1+'Languages Available'!$D$1)","v":204}]
[205]
[206,"< 9m",{"$f":"VLOOKUP(A559,Options!$C$4:$I$235,1+'Languages Available'!$D$1)","v":206}]
[207,"9m – 10m",{"$f":"VLOOKUP(A560,Options!$C$4:$I$235,1+'Languages Available'!$D$1)","v":207}]
[208,">10m",{"$f":"VLOOKUP(A561,Options!$C$4:$I$235,1+'Languages Available'!$D$1)","v":208}]
[209,"no ramps",{"$f":"VLOOKUP(A562,Options!$C$4:$I$235,1+'Languages Available'!$D$1)","v":209}]
[210]
[211," <7.5m",{"$f":"VLOOKUP(A564,Options!$C$4:$I$235,1+'Languages Available'!$D$1)","v":211}]
[212,"7.5m – 9m",{"$f":"VLOOKUP(A565,Options!$C$4:$I$235,1+'Languages Available'!$D$1)","v":212}]
[213,">9m",{"$f":"VLOOKUP(A566,Options!$C$4:$I$235,1+'Languages Available'!$D$1)","v":213}]
[214,"no ramps",{"$f":"VLOOKUP(A567,Options!$C$4:$I$235,1+'Languages Available'!$D$1)","v":214}]
[215]
[216,"<5%",{"$f":"VLOOKUP(A569,Options!$C$4:$I$235,1+'Languages Available'!$D$1)","v":216}]
[217,"5% -7%",{"$f":"VLOOKUP(A570,Options!$C$4:$I$235,1+'Languages Available'!$D$1)","v":217}]
[218,">7%",{"$f":"VLOOKUP(A571,Options!$C$4:$I$235,1+'Languages Available'!$D$1)","v":218}]
[219,"no gradient",{"$f":"VLOOKUP(A572,Options!$C$4:$I$235,1+'Languages Available'!$D$1)","v":219}]
[220]
[221,"multi-storey open daylight",{"$f":"VLOOKUP(A574,Options!$C$4:$I$235,1+'Languages Available'!$D$1)","v":221}]
[222,"multi-storey closed no daylight",{"$f":"VLOOKUP(A575,Options!$C$4:$I$235,1+'Languages Available'!$D$1)","v":222}]
[223,"underground",{"$f":"VLOOKUP(A576,Options!$C$4:$I$235,1+'Languages Available'!$D$1)","v":223}]
[224]
[225,"split level",{"$f":"VLOOKUP(A578,Options!$C$4:$I$235,1+'Languages Available'!$D$1)","v":225}]
[226,"floors with helicons or straight ramps",{"$f":"VLOOKUP(A579,Options!$C$4:$I$235,1+'Languages Available'!$D$1)","v":226}]
[227,"ramped parking floors",{"$f":"VLOOKUP(A580,Options!$C$4:$I$235,1+'Languages Available'!$D$1)","v":227}]
[228,"other",{"$f":"VLOOKUP(A581,Options!$C$4:$I$235,1+'Languages Available'!$D$1)","v":228}]
[229]
[230,"barrier/gate control",{"$f":"VLOOKUP(A583,Options!$C$4:$I$235,1+'Languages Available'!$D$1)","v":230}]
[231,"P&D control",{"$f":"VLOOKUP(A584,Options!$C$4:$I$235,1+'Languages Available'!$D$1)","v":231}]
[232,"other",{"$f":"VLOOKUP(A585,Options!$C$4:$I$235,1+'Languages Available'!$D$1)","v":232}]

{"sheet":"Languages (2)","index":23,"n_rows":273,"n_cols":2,"rows_kept":273,"cut":false,"hidden":true,"merged":[]}
["New Language"]
[1,2]
[{"$f":"VLOOKUP(A2,'Languages Available'!$A$3:$B$23,2)","v":"English"},{"$f":"A1","v":"New Language"}]
["Mandatory Minimum Conditions"]
["Car park must be for public use"]
["Minimum headroom = 1.90 m, generally in the public areas. Incidental lower obstacles must be clearly marked."]
["Minimum headroom = 2,00 m, generally in the public areas. Incidental lower obstacles must be clearly marked."]
["There must be at least one dedicated entry and exit lane although additional tidal flow lanes are allowed."]
["70% of bays must be at least 2.30m wide. For renovated car parks, over ten years old, minimum bay width of 2.25m is allowed (in that case a penalty applies - check M8)."]
["70% of bays must be at least 2.40m wide."]
["All straight ramps for  unidirectional traffic must be minimum 2.7 metres wide. Bidirectional ramps must be at least 6m wide with lane markings. Ramp width is measured between walls or pillars"]
["Curved ramps for single directional traffic must have an external radius of minimum 8.00 metres with lane width of minimum 3.5 metres. For bidirectional curved ramps this applies for the inner driving lane. The outside driving lane must be minimum 3.5 metres wide as well. "]
["Ramp gradients must not exceed 20% , to be measured at the middle of driving lane.  At bidirectional curved ramps this applies for the inner (steepest) driving lane."]
["If the car park has paid parking and access control by barriers or gates, staff must be contactable at the pay point/exit point and secured pedestrian entries."]
["Receipt for payment must be provided when requested."]
["All turning movements must be capable of being completed without reversing (moving in/out the parking bay and cul-de-sacs excluded)"]
["Average light levels on parking area at floor is at minimum 20 Lux"]
["Average light levels on parking area at floor is at minimum 50 Lux"]
["Lighting"]
["Item List (values in Lux, see user manual for measurement)"]
["Vehicular entry area; at floor level\n•  Above 200 Lux = 5;\n•  Between 75– 200 Lux: 0,04 pt per Lux over 75  \n•  Below 75 Lux = 0"]
["Entry; at 1 m height near ticket-machine\n•  Above 200 Lux = 3;\n•  Between100– 200 Lux: 0,03 pt per Lux over 100\n•  Below 100 Lux = 0"]
["Exit; at 1 m height near barrier/ticket-machine\n•  Above 200 Lux = 3;\n•  Between100– 200 Lux: 0,03 pt per Lux over 100\n•  Below 100 Lux= 0"]
["At pay-machine; at 1 m height\n•  Above 200 Lux =4;\n•  Between100– 200 Lux: 0,04 pt per Lux over 100\n•  Below 100 Lux= 0;\n•  No Pay Machines : same as exit (enter zero if this is the case)"]
["At cashier; at counter height\n•  Above 200 Lux =4;\n•  Between100– 200 Lux: 0,04 pt per Lux over 100\n•  Below 100 Lux= 0;\n•  No cashier = 3 (enter zero if this is the case)"]
["In elevator; at floor level\n•  Above 70 Lux = 4;\n•  Between30– 70 Lux: 0,1 pt per Lux over 30\n•  Below 30 Lux = 0;\n•  Single level without elevator = 3"]
["In staircases and all other exclusive pedestrian routes; at floor level\n•  Above 90 Lux = 3;\n•  Between30– 90 Lux: 0,05 pt per Lux over 30\n•  Below 30 Lux = 0;"]
["Light levels on parking area at floor level: (plesase fill grid below) \nAverage light level of grid:\n•  Above 100 Lux= 10;\n•  Between20– 100 Lux: 0,125 pt per Lux over 20 \n•  Below 20 Lux= 0"]
["Uniformity of light levels in grid as standard deviation\n•  Under 25% of avg light level = 10;\n•  Between25– 50%: 0,4 pt per % under 50%\n•  Above 50% =  0"]
["Auxiliary Grid for 2.8"]
["end of parking space under/between light fitting"]
["halfway parking space under/between light fitting"]
["edge of driveway under/between light fitting"]
["center of driveway under/between light fitting"]
["other edge of driveway under/between light fitting"]
["Car Entry / Car Exit"]
["Car park headroom limit identified at entrance"]
["Correct sign at entrance"]
["Height barrier"]
["Rubber lip to prevent damage"]
["Height:\n(The car park should receive one point for each 10cm of height above 1.90m up to 2.20 m)"]
["Traffic signs to define limitations in use of facility.\n• Clear signing = 3\n• Incomplete signing = 2\n• No signing = 0)"]
["Information on:"]
["Operators terms & conditions within the car park:"]
["Daily opening hours:"]
["Scale of tariffs:"]
["Readibility of tariff system:"]
["Design entry/exit area"]
["Entry ticket- machine easy to reach:"]
["Exit ticket- machine easy to reach:"]
["Longitudinal slope at the ticket machines"]
["Entry lane:\n• 0-2% (car doesn’t move without brake) = 1\n• 2-5% = 0\n• Above 5% = -1"]
["Exit lane:\n• 0-2% (car doesn’t move without brake) = 1\n• 2-5% = 0\n• Above 5% = -1"]
["Kerb design to avoid damage to average vehicle’s wheels:\n(Yes = 2, No protection = 0, No kerbs in entry/exit area = 2)"]
["Anti slip surfaces access/egress ramps:\n(Anti slip = 1, Slippery when wet = 0)"]
["Access security"]
["Barrier"]
["Intercom"]
["CCTV"]
["Licence Plate Recognition"]
["Full height fast closing gates"]
["Staffed access(Entry or exit)"]
["Entry/Exit of the building: width between structure (per lane)\n(< 3 m =0, 3 – 3.3 m =1, > 3.3 m = 2)"]
["Exit: exit slope ends at least 5 meters before crossing traffic (pedestrians/cyclists):"]
["subtotal  car entry/exit"]
["Parking Area"]
["Pillar placement for at least 85% of bays:\n• does not intrude into the parking area = 8 \n• at beginning of stall = 0\n• next to car door = 0\n• at back of stall but intrudes into the parking area = 4"]
["Visibility (many/few dead corners, walls in the car park etc.)\nGood=4, Medium=2 or Bad=0"]
["Signage for car driver:"]
["Do traffic signs conform to national road code?"]
["Routing and turn signs: Is signage clear, complete and unambiguous? "]
["Complete ?"]
["Easy to see ?"]
["Unambiguous ?"]
["Exit signs in the car park: Is signage clear, complete and unambiguous? "]
["Complete ?"]
["Easy to see ?"]
["Unambiguous ?"]
["Parking bay marks"]
["Parking bays are clearly marked ?"]
["Bay markings extend up walls to assist driver ?"]
["Are Road Markings:"]
["Complete ?"]
["Easy to see ?"]
["Unambiguous ?"]
["Availability of spaces for disabled with wheelchair access anounced at the entrance the car park:"]
["Accessible for wheelchair ?"]
["Bays minimum 3.5 m wide ?"]
["Close to pedestrian exit ?"]
["Guidance to disabled spaces ?"]
["Parking angle at 85 % of bays:\n(Angle 76-90° = 0, Angle  45-75° = 2)"]
["Width of bays (85 % of bays), A or B: \nA: Parking angle 76 – 90 degrees\n(2.25m = -5, 2.30m = 0, 2.35m = 2, 2.40m = 4, 2.45m = 6, 2.50m = 8) \nB: Parking angle 45-75 degrees\n(2.25m = -5, 2.30m = 1, 2.35m = 3, 2.40m = 5, 2.45m = 8)\nWidth of 2.25m only applies for renovated car parks, new car parks must be minimum 2.30m"]
["Total unit measure of one way isle width and\ndepth of two parking bays, depending on parking angle and bay width:\nBay width: 2.50m / 2.45m / 2.40m / 2.35m / 2.30m\n90° :           16.00 /  16.30 /  16.60 /  16.90 / 17.30\n85° :           15.70 /  16.00 /  16.30 /  16.60 / 16.95\n80° :           15.40 /  15.70 /  16.00 /  16.30 / 16.60\n75° :           14.95 /  15.25 /  15.55 /  15.85 / 16.15\n70° :           14.50 /  14.80 /  15.10 /  15.40 / 15.70\n65° :           14.40 /  14.40 /  14.55 /  14.80 / 15.10\n60° :           14.30 /  14.30 /  14.30 /  14.30 / 14.50\n55° :           14.00 /  14.00 /  14.00 /  14.00 / 14.10\n50° :           13.75 /  13.75 /  13.75 /  13.75 / 13.75\n45° :           13.50 /  13.50 /  13.50 /  13.50 / 13.50\n\nTotal unit measure as above qualifies for 3 points. \nUp to 30 cm less qualifies for 2 points\nUp to 60 cm less qualifies for 1 point\nMore than 60 cm less: no points given"]
["Kerb design to avoid damage to average vehicle’s wheels\n•  Yes = 2, No protection = 0"]
["Vehicle Ramps"]
["Is this a Single level car park without vehicular ramps or ramper floor?"]
["Ramp surface between parking areas (Anti slip 1, Smooth 0, no ramps 1)"]
["Ramp longitudinal gradient connecting ramps (not used for parking)\n•  <10%=3, 10-15%=1, >15%=0, no ramps=3"]
["Ramp width (between kerbs) all ramps measured at narrowest point "]
["Curved ramps must be 1 m wider for same score. Are the ramps curbed?"]
[{"$f":"CONCATENATE(\"Please choose width. \",IF(B100=yes,\"< 4m=0, 4-4.3m=1, >4.3m=2, no ramps=2\",\"< 3m=0, 3-3.3m=1, >3.3m=2, no ramps=2\"))","v":"Please choose width. < 3m=0, 3-3.3m=1, >3.3m=2, no ramps=2"}]
["Ramp curvature (external radius) curved ramps\n•  up to 9m=0, 9–10 m=1, >10m=2, no ramps=2\nAt dual way ramps this measure refers to the inner lane."]
["Approach curve to straight ramps\n•  <7.5m=0, 7.5–9m=1, >9m=2, no ramps=2"]
["Ramped parking floor longitudinal gradient\n•  <5%=3, 5-7 =1, >7%=0, no gradient=3"]
["Pedestrian Access"]
["Item List"]
["Headroom for pedestrians - excluding doors\n• <2.00m = 0\n• 2.00m – 2.10m = 1\n• 2.10m – 2.20m = 2\n• > 2.20m = 3"]
["Separate walking route (i.e. heightened; zebra stripes or colours) (yes = 2, no = 0)"]
["Are pedestrian entrance doors easy to use?\n(Yes, automatic or open connection = 4, Easy to open = 2, No = 0)"]
["Pedestrian access controlled by ticket/pass card when car park open (Yes=1, No=0)"]
["City plan a central location in car park:\n(On Every pedestrian exit = 2, One location = 1, No = 0)"]
["Guidance:"]
["to key attractions around the car park at pedestrian exit (Yes=1, No=0):"]
["around the car park to pedestrian entrances (Yes=1, No=0):"]
["Is this a Single level car park at ground floor, (not open surface) ?"]
["Is there elevators serving street level?"]
["Number of Elevators at street level:\n(1 elevator = 1, 2 + elevators = 5)"]
["Size of elevators:\n(More Than 8 people = 3, 4-8 people = 1, less than 4 = 0)"]
["Visibility from elevator inside to hall/parking area\n(no visibility from elevator = 0, glazed doors/walls = 3, no elevator = 0)"]
["Level indication:"]
["in elevator:"]
["in elevator foyer:"]
["Elevator control buttons at wheelchair height\n•  Yes = 1, Other = 0"]
["Doors directly to parking area"]
["Width (<90 cm =0, >=90 cm = 2)"]
["Emergency door, standard open (Yes=2, No= 0)"]
["Visibility (Glazed door/wall = 3, No Glass = 0)"]
["Are elevators the main vertical connection? (stairs only secondary or escape)"]
["Stairwells (visibility and orientation)"]
["Clear View (Yes = 1, No = 0, Irrelevant = 1)"]
["Level Indication (Yes = 1, No = 0, Irrelevant = 1)"]
["Stairs (incl. heightened visibility of steps)"]
["Width (< 1.5 m = 0, > 1.5m = 2)"]
["Hand Rails (No hand rail =0, One Side = 1, Two sides=2)"]
["Heightened visibility of steps for people with poor eyesight (Yes = 2, No = 0)"]
["Anti-slip surfacing on stairs: (Yes = 2, No = 0)"]
["External openings in stairwell\n(window/grilled to outside or car park  =2, none =0)"]
["Security Equipment"]
["Item List"]
["CCTV with notice at entrance = 3, No CCTV =0"]
["Staff surveillance (on-site or remote)\n•  Yes = 5, No = 0"]
["CCTV at:"]
["Car Entry: Yes =1, No =0"]
[" Car Exit: Yes =1, No =0"]
["Pay Machine: Yes =1, No =0"]
["Elevator Hall, every level: Yes =1, No =0"]
["Stairwells, every level: Yes =1, No =0"]
["Pedestrian Entrances: Yes =1, No =0"]
["Most of Parking Area (65%):Yes =3, No =0"]
[" Ramps: Yes = 1, No = 0"]
["Staff contactable via:"]
["Intercom at pay machine and/or controlled entries (24/7=3, All access hours if not 24/7= 2, Part time/not available = 0)"]
["Emergency call system in parking area (24/7=3, All access hours if not 24/7= 2, Part time/not available = 0)"]
["Recognizable staff present and patrolling car park\n(24/7 = 3, During access Hours = 2, Less than access Hours = 1, No = 0)"]
["Lockable vehicle exit/entry: \n(Closed gate/rolling shutter  after access hours = 2, Secured: fast opening gate during day = 4, Secured: slow opening gate during day = 2, No provisions = 0)"]
["Lockable pedestrian exit/entry (after opening hours).\n(Door/gate/rolling shutter <= 15cm maximum aperture = 2, over 15 cm = 0, no provisions = 0, Irrelevant (24 hours opening) = 2)"]
["Grilles on external openings & security grilles\n(<= 15 cm = 2, > 15 cm or no protection= 0, Irrelevant (no external openings) = 2)"]
["Wayfinding Inside and Outside"]
["Item List"]
["Identification of vacant parking spaces"]
["Parking floor level (yes/good = 2, no/bad = 0)"]
["Parking row (yes/good = 1, no/bad = 0)"]
["Individual stall indication (yes/good = 2, no/bad = 0)"]
["Way finding (vehicles)"]
["Are floors clearly and separately identified for drivers? (Good =3, Adequate =2, Poor =1, No =0)"]
["Are sub-areas of floors clearly identified for drivers? (Good =3, Adequate =2, Poor =1, No =0)"]
["Are fire escapes and escape routes clearly marked\n• Clear from all locations = 3\n• most locations= 2\n• some locations=1\n• No marking of escape routes=0)"]
["Are floor levels clearly marked?\n(good =3, adequate=2, poor=1, none =0. Single level car parks = 3)"]
["Is there additional signing or prompts to orient the pedestrian on the parking deck\n(good =2, some =1, none = 0)"]
["Are parking spaces individually numbered\n(Numbered including floor identification =2, Just numbers =1, none =0)"]
["Use of colours for  way finding\n(Yes= 1, No= 0)"]
["Guidance sign posting for cars on roads to car park"]
["Static sign system only (Yes = 1, No = 0)"]
["Dynamic sign system additionally (Yes = 1, No = 0)"]
["Illuminated signage at car park entrance"]
["Signal green arrow, red cross for direction (Yes = 1, No = 0)"]
["Signal full/free (Yes = 1, No = 0)"]
["Signage at pedestrian entrance (Yes = 1, No = 0)"]
["Confort and Miscellaneous"]
["Notice-board at pedestrian entrance/exit showing:"]
["Access hours normal/special (yes = 1, no = 0)"]
["Readable & understandable tariff board (yes = 1, no = 0)"]
["Operators terms and conditions (yes = 1, no = 0)"]
["Payment options (pay at exit/pay at pay station):"]
["Accepts coins? (yes =1, no =0)"]
["Change given? (yes =1, no =0)"]
["Accepts banknotes?  (yes =1, no =0)"]
["Accepts bank cards?  (yes =1, no =0)"]
["Payment by smart phone? (yes =1, no =0)"]
["Payment by card/phone at exit? (yes =1, no =0)"]
["ID & payment by LPR? (yes =1, no =0)"]
["Accepts other cards: How many? (1 point per additional option up to 3)"]
["Payment at staffed desk: (yes = 1, no = 0)"]
["Is this a Pay and Display Car Park?"]
["Number of Pay points for Barrier controlled car parks:\n(One pay station = 0,  More than one =1, One at each pedestrian entrance, excluding fire escapes =2, More than one at each pedestrian entrance =3)"]
["Number of Pay points for Pay and Display Car Parks\n(One =0, < 1 for every 50 spaces =2, >1 for every 50 spaces =3)"]
["Customer toilets:"]
["Exist? (yes= 2, no= 0)"]
["Disabled toilet? (yes=1, no= 0)"]
["unisex = 0, male/female separated = 1"]
["attendant: yes=1, no= 0"]
["Use of colours/ embellishing works"]
["Coloured pillars =1, no/concrete grey = 0"]
["Coloured walls =1, no/concrete grey = 0"]
["Extra embellishment"]
[" Artwork: (Yes = 2, No = 0)"]
["Planters: (Yes = 1, No = 0)"]
["Other: (Yes = 1, No = 0)"]
["Mobile phone coverage (Yes = 2, No = 0)"]
["Continuity of radio signals (Yes = 1, No = 0)"]
["Music"]
["Background music: yes = 2, No = 0"]
["Differentiation for way finding :  yes =1, No = 0"]
["Energy and Environment"]
["Energy Saving Lighting Systems"]
["Power Factor Compensation (Yes=1, No=0)"]
["Other Systems (Yes=1, No=0)"]
["Movement detection variable lights, remaining quality (yes= 2, no= 0)"]
["Adaptable lighting for daylight compensation at entrance area \n(yes= 2, no= 0)"]
["Adaptable lighting for ambient light conditions at parking floor from daylight\n(yes= 2, no= 0, Irrelevant (below ground) =2)"]
["Solar panels on the roof or other green energy initiatives (yes= 2, no= 0)"]
["Special treatment of cleaning water:\n•  yes= 2, no= 0"]
["Grey water or re-use of rain water\n•  yes= 2, no= 0\n"]
["Electric Vehicles recharging points: (Yes, more than one= 2, One recharging point=1, None=0)"]
["Car sharing and similar initiatives\n•  yes= 2, no= 0"]
["Other environmental or zero emission  initiatives\n•  yes= 2, no= 0"]
["Minus Points"]
["Presence of Graffiti"]
["Stairwells (Yes= -2, No= 0)"]
["Elevator (Yes= -2, No= 0)"]
["Toilets (Yes= -2, No= 0)"]
["Parking area (Yes= -2, No= 0)"]
["Outside walls (Yes= -2, No= 0)"]
["Presence of dirt"]
["Stairwells (Yes= -2, No= 0)"]
["Elevator (Yes= -2, No= 0)"]
["Toilets (Yes= -2, No= 0)"]
["Parking area (Yes= -2, No= 0)"]
["Outside of entrance for pedestrians + cars (Yes= -2, No= 0)"]
["Poor quality of paint work"]
["Stairwells (Yes= -2, No= 0)"]
["Elevator (Yes= -2, No= 0)"]
["Parking area (Yes= -2, No= 0)"]
["Poor quality horizontal markings (Yes= -2, No= 0)"]
["Poor quality/lack of maintenance (pot holes ,damages) "]
["Floors (Yes= -2, No= 0)"]
["Walls (Yes= -2, No= 0)"]
["Evidence of standing water (Yes= -2, No= 0)"]
["Evidence of bad smells"]
["Elevators (Yes= -2, No= 0)"]
["Stairwells (Yes= -2, No= 0)"]
["Parking deck (Yes= -2, No= 0)"]
["Over 15% of parking spaces in cul-de-sac without occupancy indication. (Yes= -5, No=0)"]
["Various points of criticism (to explain!)\n[E.g. hollow sound, squeaking tyres, unintended visitors, etc.] up to -10"]
["Penalty for Mandatory Condition 1.4 Applies"]
["Bonus Points"]
["Extra provisions in car park"]
["Special motorcycle area (Yes= 1, No= 0)"]
["Lockers for customers’ use (Yes= 1, No= 0)"]
["Other aids (Yes= 1, No= 0)"]
["Bicycle rent (Yes= 1, No= 0)"]
["Other Driver Assistance (Yes= 1, No= 0)"]
["Vending Machines (Yes= 1, No= 0)"]
["Heart Defibrillator (Yes= 1, No= 0)"]
["First aid trained staff (Yes= 1, No= 0)"]
["Real time traffic data (Yes= 1, No= 0)"]
["Other real time accessible information (e.g. local events) (Yes= 1, No= 0)"]
["Measures to avoid traffic queues at peak hours (i.e. tidal lane at car entry/exit) - (Yes= 3, No= 0)"]
["Turn around possibility for cars before height barrier or full sign to prevent reversing (Yes= 3, No= 0)"]
["Customer service desk (Yes= 1, No= 0)"]
["Escalators and/or travellators\n(To/from all levels =5, To/from some levels =3, No Escalators or Travellators = 0)"]
["Localisation of parked cars by ticket or license plate\n(Yes= 1, No= 0)"]
["Other positive points e.g. extra services, friendly staff, tiled walls/floors, good fit of the car park in cityscape etc up to ten additional bonus points. To be explicitly identified."]

{"sheet":"Options (2)","index":24,"n_rows":235,"n_cols":2,"rows_kept":235,"cut":false,"hidden":true,"merged":[]}
[{"$f":"'Languages (2)'!A1","v":"New Language"}]
[]
[{"$f":"'Languages (2)'!A3","v":"English"},{"$f":"A1","v":"New Language"}]
["Morning"]
["Afternoon"]
["Evening"]
[]
["Sunny"]
["Cloudy"]
["Rain"]
["Dusk"]
["Night"]
[]
[" > 75%"]
[" 50% - 75%"]
[" about 50%"]
[" 25% - 50%  "]
["< 25%"]
[]
["OK"]
["Fail"]
[]
["Yes"]
["No"]
["Irrelevant"]
["Clear signing"]
["Incomplete signing"]
["No signing"]
[]
["0%-2%"]
["2%-5%"]
["Above 5%"]
[]
["Yes "]
["No protection"]
["No kerbs in entry/exit area"]
[]
["Anti slip"]
["Slippery when wet"]
[]
["< 3 m"]
["3m – 3.3m"]
["> 3.3m"]
[]
["Pillar does not intrude into the parking area"]
["Pillar at beginning of stall"]
["Pillar next to car door"]
["Pillar at back of stall but intrudes into the parking area"]
[]
["Good"]
["Medium"]
["Bad"]
[]
["Angle 76°-90°"]
["Angle  45°-75°"]
[]
[" 2.25 m - 2.30 m"]
[" 2.30 m - 2.35 m"]
[" 2.35 m - 2.40 m"]
[" 2.40 m - 2.45 m"]
[" 2.45 m - 2.50 m"]
[" above 2.50 m"]
[]
["Compliant with the table"]
["Up to 30 cm less"]
["Up to 60 cm less"]
["More than 60 cm less"]
[]
["Anti-Slip"]
["Smooth"]
["No Ramps"]
[]
["< 2.00m"]
["2.00m – 2.10m"]
["2.10m – 2.20m"]
["> 2.20m"]
[]
["Yes (automatic or open connection)"]
["Easy to Open"]
["No"]
[]
["Every pedestrian exit"]
["One location"]
["No"]
[]
["One elevator"]
["Two or more elevators"]
[]
["More Than 8 People"]
["4 to 8 people"]
["Less Than 4"]
[]
["no visibility from elevator"]
["glazed doors/walls"]
["no elevator"]
[]
["< 1.5 m"]
["> 1.5 m"]
[]
["< 90 cm"]
[">= 90 cm"]
[]
["Glazed door/wall"]
["No Glass"]
[]
["No hand rail"]
["One Side"]
["Two sides"]
[]
["window/grilled"]
["none"]
[]
["24*7"]
["All access hours if not 24*7"]
["Part time/not available"]
[]
["24*7"]
["During access Hours"]
["Less than access Hours"]
["No"]
[]
["Closed gate/rolling shutter  after access hours"]
["Secured: fast opening gate during day"]
["Secured: slow opening gate during day"]
["No provisions"]
[]
["Maximum Aperture Door/gate/rolling shutter <= 15cm"]
["Maximum Aperture Door/gate/rolling shutter > 15cm"]
["no provisions"]
["Irrelevant (24 hours opening)"]
[]
["<= 15 cm"]
[">15 cm or no protection"]
["Irrelevant (no external openings)"]
[]
["Yes/Good"]
["No/Bad"]
[]
["Good"]
["Adequate"]
["Poor"]
["No"]
[]
["Clear from all locations"]
["Clear from most locations"]
["Clear from some locations"]
["No marking of escape routes"]
[]
["Good"]
["Adequate"]
["Poor"]
["None"]
["Single Level Car Park"]
[]
["Good"]
["Some"]
["None"]
[]
["Numbered including floor identification"]
["Just numbers"]
["None"]
[]
["0"]
["1"]
["2"]
["3 or more"]
[]
["One pay station"]
["More than one"]
["One at each pedestrian entrance"]
["More than one at each pedestrian entrance"]
[]
["One"]
["< 1 for every 50 spaces"]
[">1 for every 50 spaces"]
[]
["Unisex"]
["Male/Female Separated"]
[]
["Coloured pillars"]
["No/Concrete grey"]
[]
["Coloured walls"]
["No/Concrete grey"]
[]
["More than one recharging point"]
["One recharging point"]
["None"]
[]
["To/from all levels"]
["To/from some levels"]
["No Escalators or Travellator"]
[]
[" <10%"]
[" 10-15%"]
[">15%"]
["no ramps"]
[]
["< 3m"]
["3m - 3.3m"]
[">3.3m"]
["no ramps"]
[]
["< 4m"]
["4m - 4.3m"]
[">4.3m"]
["no ramps"]
[]
["< 9m"]
["9m – 10m"]
[">10m"]
["no ramps"]
[]
[" <7.5m"]
["7.5m – 9m"]
[">9m"]
["no ramps"]
[]
["<5%"]
["5% -7%"]
[">7%"]
["no gradient"]
[]
["multi-storey open daylight"]
["multi-storey closed no daylight"]
["underground"]
[]
["split level"]
["floors with helicons or straight ramps"]
["ramped parking floors"]
["other"]
[]
["barrier/gate control"]
["P&D control"]
["other"]

{"sheet":"Tags (2)","index":25,"n_rows":71,"n_cols":2,"rows_kept":71,"cut":false,"hidden":true,"merged":[]}
[{"$f":"'Options (2)'!A1","v":"New Language"}]
[1,2]
[{"$f":"'Options (2)'!A3","v":"English"},{"$f":"VLOOKUP(B2,'Languages Available'!$A$3:$B$23,2)","v":"Dutch"}]
["Date"]
["Language"]
["Country"]
["Name of Car Park"]
["Address"]
["City"]
["Number of Spaces"]
["Operator"]
["Contact Name"]
["e-Mail"]
["Phone"]
["Judged by"]
["Evaluation Conditions"]
["Time of Day"]
["Weather Conditions"]
["Occupancy Rate"]
["Completed"]
["Incompleted"]
["Compliant"]
["Comments"]
["Number of Ok:"]
["Number of Fails:"]
["Not Evaluated:"]
["Pass"]
["Fail"]
["Incomplete"]
["Total Items"]
["Total Items + SubItems"]
["Itens Completed"]
["Not measured"]
["Score"]
["Maximum Score"]
["Percentage"]
["Category Value"]
["Global Evaluation"]
["Category"]
["Number of Items"]
["Number of Oks"]
["Number of Fails"]
["To be Completed"]
["% Obtained"]
["Minimum"]
["Category Points"]
["Points Obtained"]
["Status"]
["% Completion:"]
["Subtotals"]
["Totals"]
["Minimum Requirement for ESPA Award"]
["Categories Minimum Points"]
["Espa Award"]
["Item List"]
["Measured value"]
["Maximum Contribuition for Final Score"]
["Contribuition for Final Score"]
["Remarks"]
["Notes"]
["This will erase all data in ESPA Worksheet. Are you sure?"]
["You have entered an incorrect password. ESPA Worksheets could not be umprotected."]
["Please enter your password to umprotect ESPA Worksheet:"]
["Password Input"]
["Incorrect Password"]
["This will print 13 pages on your active printer. Are you sure?"]
["Alert"]
["Changing languge will reset al your previous answers. Do you want to proceed?"]
["Mandatory Conditions for Gold Award"]
["ESPA Gold Award"]
["Global Evaluation - Gold Award"]

{"sheet":"Welcome Sheet","index":26,"n_rows":1,"n_cols":1,"rows_kept":1,"cut":false,"hidden":true,"merged":[]}
[{"$f":"Tags!B72","v":"The ESPA Worksheet uses Macros. Please enable content or close and reopen with Macros Enabled"}]

{"sheet":"Translation Sheet","index":27,"n_rows":585,"n_cols":3,"rows_kept":585,"cut":false,"hidden":true,"merged":[]}
[4,"Translation Sheet",{"$f":"VLOOKUP(A1,'Languages Available'!A3:B12,2)","v":"Deutsch"}]
[]
["TAB: Languages"]
[1,{"$f":"Languages!D4","v":"Mandatory Minimum Conditions"},{"$f":"VLOOKUP(A4,Languages!$A$4:$I$273,3+$A$1)","v":"Mindestbedingungen"}]
[2,{"$f":"Languages!D5","v":"Car park must be for public use"},{"$f":"VLOOKUP(A5,Languages!$A$4:$I$273,3+$A$1)","v":"Das Parkhaus muss öffentlich sein"}]
[3,{"$f":"Languages!D6","v":"Minimum headroom = 1.90 m, generally in the public areas. Incidental lower obstacles must be clearly marked."},{"$f":"VLOOKUP(A6,Languages!$A$4:$I$273,3+$A$1)","v":"Mindestdurchfahrtshöhe = 1.90 m im allgemein zugänglichen Bereich. Einzelne niedrigere Hindernisse müssen deutlich gekennzeichnet sein."}]
[4,{"$f":"Languages!D7","v":"Minimum headroom = 2,00 m, generally in the public areas. Incidental lower obstacles must be clearly marked."},{"$f":"VLOOKUP(A7,Languages!$A$4:$I$273,3+$A$1)","v":"Mindestdurchfahrtshöhe = 2,00 m im allgemein zugänglichen Bereich. Einzelne niedrigere Hindernisse müssen deutlich gekennzeichnet sein."}]
[5,{"$f":"Languages!D8","v":"There must be at least one dedicated entry and exit lane although additional tidal flow lanes are allowed."},{"$f":"VLOOKUP(A8,Languages!$A$4:$I$273,3+$A$1)","v":"Es müssen getrennte Ein- und Ausfahrtsspuren vorhanden sein. Tageszeitlich in wechselnder Fahrtrichtung genutzte Wechselspuren sind zulässig."}]
[6,{"$f":"Languages!D9","v":"70% of bays must be at least 2.30m wide. For renovated car parks, over ten years old, minimum bay width of 2.25m is allowed (in that case a penalty applies - check M8)."},{"$f":"VLOOKUP(A9,Languages!$A$4:$I$273,3+$A$1)","v":"70% der Stellplätze müssen mindestens 2,30 m breit sein. Für renovierte Parkhäuser, die älter als 10 Jahre sind, wird ausnahmsweise eine Stellplatzbreite von 2,25 m toleriert. In diesem Fall kommt ein Pauschalabzug zur Anwendung (siehe M8)."}]
[7,{"$f":"Languages!D10","v":"70% of bays must be at least 2.40m wide."},{"$f":"VLOOKUP(A10,Languages!$A$4:$I$273,3+$A$1)","v":"70% der Stellplätze müssen mindestens 2,40 m breit sein."}]
[8,{"$f":"Languages!D11","v":"All straight ramps for  unidirectional traffic must be minimum 2.7 metres wide. Bidirectional ramps must be at least 6m wide with lane markings. Ramp width is measured between walls or pillars"},{"$f":"VLOOKUP(A11,Languages!$A$4:$I$273,3+$A$1)","v":"Gerade Rampen mit Einrichtungsverkehr müssen mindestens 2,70 m breit sein.\rGerade Gegenverkehrsrampen müssen mindestens 6 m breit sein und eine Fahrbahnmarkierung aufweisen.\rDie Breite der Rampen wird zwischen Wänden oder Stützen gemessen.\r"}]
[9,{"$f":"Languages!D12","v":"Curved ramps for single directional traffic must have an external radius of minimum 8.00 metres with lane width of minimum 3.5 metres. For bidirectional curved ramps this applies for the inner driving lane. The outside driving lane must be minimum 3.5 metres wide as well. "},{"$f":"VLOOKUP(A12,Languages!$A$4:$I$273,3+$A$1)","v":"Gekrümmte Rampen mit Einrichtungsverkehr müssen einen Außenradius von mindestens 8,00 m aufweisen und die Fahrbahn muss mindestens 3,50 m breit sein. Bei gekrümmten Rampen mit Gegenverkehr gilt dasselbe für die innere Spur. Die äußere Spur muss ebenfalls mindestens 3,50 m breit sein."}]
[10,{"$f":"Languages!D13","v":"Ramp gradients must not exceed 20% , to be measured at the middle of driving lane.  At bidirectional curved ramps this applies for the inner (steepest) driving lane."},{"$f":"VLOOKUP(A13,Languages!$A$4:$I$273,3+$A$1)","v":"Das Gefälle von Rampen darf 20 % nicht überschreiten. Es wird in der Fahrbahnachse gemessen. Bei mehrspurigen Rampen gilt dies jeweils für die innere (steilere) Spur."}]
[11,{"$f":"Languages!D14","v":"If the car park has paid parking and access control by barriers or gates, staff must be contactable at the pay point/exit point and secured pedestrian entries."},{"$f":"VLOOKUP(A14,Languages!$A$4:$I$273,3+$A$1)","v":"Bei bewirtschafteten Parkhäusern mit Zugangskontrolle durch Schranken oder Tore muss das Personal an allen Bezahlstationen, Ausfahrten sowie gesicherten Fußgängerzugängen z.B. kontaktierbar sein. "}]
[12,{"$f":"Languages!D15","v":"Receipt for payment must be provided when requested."},{"$f":"VLOOKUP(A15,Languages!$A$4:$I$273,3+$A$1)","v":"Ein Zahlungsnachweis muss auf Verlangen herausgegeben werden."}]
[13,{"$f":"Languages!D16","v":"All turning movements must be capable of being completed without reversing (moving in/out the parking bay and cul-de-sacs excluded)"},{"$f":"VLOOKUP(A16,Languages!$A$4:$I$273,3+$A$1)","v":"Alle Kurvenfahrten müssen ohne Zurückstoßen möglich sein (Parkierungsvorgänge und Sackgassen sind hiervon ausgenommen)."}]
[14,{"$f":"Languages!D17","v":"Average light levels on parking area at floor is at minimum 20 Lux"},{"$f":"VLOOKUP(A17,Languages!$A$4:$I$273,3+$A$1)","v":"Die durchschnittliche Beleuchtungsstärke am Boden beträgt mindestens 20 Lux."}]
[15,{"$f":"Languages!D18","v":"Average light levels on parking area at floor is at minimum 50 Lux"},{"$f":"VLOOKUP(A18,Languages!$A$4:$I$273,3+$A$1)","v":"Die durchschnittliche Beleuchtungsstärke am Boden beträgt mindestens 50 Lux."}]
[16,{"$f":"Languages!D19","v":"Lighting"},{"$f":"VLOOKUP(A19,Languages!$A$4:$I$273,3+$A$1)","v":"Beleuchtung"}]
[17,{"$f":"Languages!D20","v":"Item List (values in Lux, see user manual for measurement)"},{"$f":"VLOOKUP(A20,Languages!$A$4:$I$273,3+$A$1)","v":"Positionsliste (Werte in Lux, bezüglich der Messungen siehe Benutzungsanleitung)"}]
[18,{"$f":"Languages!D21","v":"Vehicular entry area; at floor level\r•  Above 200 Lux = 5;\r•  Between 75– 200 Lux: 0,04 pt per Lux over 75  \r•  Below 75 Lux = 0"},{"$f":"VLOOKUP(A21,Languages!$A$4:$I$273,3+$A$1)","v":"Einfahrtsbereich, auf dem Boden\r•  über 200 Lux = 5;\r•  zwischen 75 - 200 Lux: 0,04 pt pro Lux über 75  \r•  weniger als 75 Lux = 0"}]
[19,{"$f":"Languages!D22","v":"Entry; at 1 m height near ticket-machine\r•  Above 200 Lux = 3;\r•  Between100– 200 Lux: 0,03 pt per Lux over 100\r•  Below 100 Lux = 0"},{"$f":"VLOOKUP(A22,Languages!$A$4:$I$273,3+$A$1)","v":"Einfahrt ;  in 1 m Höhe beim Ticketgeber\r•  über 200 Lux = 3;\r•  zwischen 100 - 200 Lux: 0,03 pt pro Lux über 100\r•  weniger als 100 Lux = 0"}]
[20,{"$f":"Languages!D23","v":"Exit; at 1 m height near barrier/ticket-machine\r•  Above 200 Lux = 3;\r•  Between100– 200 Lux: 0,03 pt per Lux over 100\r•  Below 100 Lux= 0"},{"$f":"VLOOKUP(A23,Languages!$A$4:$I$273,3+$A$1)","v":"Ausfahrt ;  in 1 m Höhe beim Ausfahrtskontrollgerät\r•  über 200 Lux = 3;\r•  zwischen 100 - 200 Lux: 0,03 pt pro Lux über 100\r•  weniger als 100 Lux= 0"}]
[21,{"$f":"Languages!D24","v":"At pay-machine; at 1 m height\r•  Above 200 Lux =4;\r•  Between100– 200 Lux: 0,04 pt per Lux over 100\r•  Below 100 Lux= 0;\r•  No Pay Machines : same as exit (enter zero if this is the case)"},{"$f":"VLOOKUP(A24,Languages!$A$4:$I$273,3+$A$1)","v":"Kassenautomat, in 1 m Höhe (in diesem Fall bitte Null eingeben)\r•  über 200 Lux = 4;\r•  zwischen 100 - 200 Lux: 0,04 pt pro Lux über 100\r•  weniger als 100 Lux = 0;\r•  Kein Kassenautomat: wie bei Ausfahrt"}]
[22,{"$f":"Languages!D25","v":"At cashier; at counter height\r•  Above 200 Lux =4;\r•  Between100– 200 Lux: 0,04 pt per Lux over 100\r•  Below 100 Lux= 0;\r•  No cashier = 3 (enter zero if this is the case)"},{"$f":"VLOOKUP(A25,Languages!$A$4:$I$273,3+$A$1)","v":"An der Kasse, auf Höhe des Tresens\r•  über 200 Lux = 4;\r•  zwischen 100 - 200 Lux: 0,04 pt pro Lux über 100\r•  weniger als 100 Lux = 0;\r•  Keine Kasse = 3  (in diesem Fall bitte Null eingeben)"}]
[23,{"$f":"Languages!D26","v":"In elevator; at floor level\r•  Above 70 Lux = 4;\r•  Between30– 70 Lux: 0,1 pt per Lux over 30\r•  Below 30 Lux = 0;\r•  Single level without elevator = 3 (enter zero if this is the case)"},{"$f":"VLOOKUP(A26,Languages!$A$4:$I$273,3+$A$1)","v":"In Aufzügen, auf dem Boden\r•  über 70 Lux = 4;\r•  zwischen 30 - 70 Lux: 0,1 pt pro Lux über 30\r•  weiniger als 30 Lux = 0;\r•  eingeschossiges Parkhaus ohne Aufzug = 3  (in diesem Fall bitte Null eingeben)"}]
[24,{"$f":"Languages!D27","v":"In staircases and all other exclusive pedestrian routes; at floor level\r•  Above 90 Lux = 3;\r•  Between30– 90 Lux: 0,05 pt per Lux over 30\r•  Below 30 Lux = 0;"},{"$f":"VLOOKUP(A27,Languages!$A$4:$I$273,3+$A$1)","v":"In Treppenhäusern und anderen ausgewiesenen Fußgängerbereichen\r•  über 90 Lux = 3;\r•  zwischen 30 - 90 Lux: 0,05 pt pro Lux über 30\r•  weniger als 30 Lux = 0;"}]
[25,{"$f":"Languages!D28","v":"Light levels on parking area at floor level: (plesase fill grid below) \rAverage light level of grid:\r•  Above 100 Lux= 10;\r•  Between20– 100 Lux: 0,125 pt per Lux over 20 \r•  Below 20 Lux= 0"},{"$f":"VLOOKUP(A28,Languages!$A$4:$I$273,3+$A$1)","v":"Beleuchtung der Parkebenen auf dem Boden: (bitte Raster unten eintragen) \rmittlere Beleuchtungsstärke innerhalb des Rasters:\r•  über 100 Lux = 10;\r•  zwischen 20 - 100 Lux: 0,125 pt pro Lux über 20 \r•  weniger als 20 Lux= 0"}]
[26,{"$f":"Languages!D29","v":"Uniformity of light levels in grid as standard deviation\r•  Under 25% of avg light level = 10;\r•  Between25– 50%: 0,4 pt per % under 50%\r•  Above 50% =  0"},{"$f":"VLOOKUP(A29,Languages!$A$4:$I$273,3+$A$1)","v":"Gleichmäßigkeit der Beleuchtung (Standardabweichung)\r•  weniger als 25% der mittleren Beleuchtungsstärke = 10;\r•  zwischen  25 - 50%: 0,4 pt pro % unter 50%\r•  über 50% =  0"}]
[27,{"$f":"Languages!D30","v":"Auxiliary Grid for 2.8"},{"$f":"VLOOKUP(A30,Languages!$A$4:$I$273,3+$A$1)","v":"Hilfsraster 2.8"}]
[28,{"$f":"Languages!D31","v":"end of parking space under/between light fitting"},{"$f":"VLOOKUP(A31,Languages!$A$4:$I$273,3+$A$1)","v":"Ende des Parkplatzes unter/zwischen Beleuchtungspunkten"}]
[29,{"$f":"Languages!D32","v":"halfway parking space under/between light fitting"},{"$f":"VLOOKUP(A32,Languages!$A$4:$I$273,3+$A$1)","v":"Mitte des Parkplatzes unter/zwischen Beleuchtungspunkten"}]
[30,{"$f":"Languages!D33","v":"edge of driveway under/between light fitting"},{"$f":"VLOOKUP(A33,Languages!$A$4:$I$273,3+$A$1)","v":"Fahrbahnrand unter/zwischen Beleuchtungspunkten"}]
[31,{"$f":"Languages!D34","v":"center of driveway under/between light fitting"},{"$f":"VLOOKUP(A34,Languages!$A$4:$I$273,3+$A$1)","v":"Fahrbahnmitte unter/zwischen Beleuchtungspunkten"}]
[32,{"$f":"Languages!D35","v":"other edge of driveway under/between light fitting"},{"$f":"VLOOKUP(A35,Languages!$A$4:$I$273,3+$A$1)","v":"Anderer Fahrbahnrand unter/zwischen Beleuchtungspunkten"}]
[33,{"$f":"Languages!D36","v":"Car Entry / Car Exit"},{"$f":"VLOOKUP(A36,Languages!$A$4:$I$273,3+$A$1)","v":"Einfahrt / Ausfahrt"}]
[34,{"$f":"Languages!D37","v":"Car park headroom limit identified at entrance"},{"$f":"VLOOKUP(A37,Languages!$A$4:$I$273,3+$A$1)","v":"An der Einfahrt angezeigte Durchfahrtshöhe"}]
[35,{"$f":"Languages!D38","v":"Correct sign at entrance"},{"$f":"VLOOKUP(A38,Languages!$A$4:$I$273,3+$A$1)","v":"Ordnungsgemäßes Zeichen an der Einfahrt"}]
[36,{"$f":"Languages!D39","v":"Height barrier"},{"$f":"VLOOKUP(A39,Languages!$A$4:$I$273,3+$A$1)","v":"Höhenbegrenzungsbalken"}]
[37,{"$f":"Languages!D40","v":"Rubber lip to prevent damage"},{"$f":"VLOOKUP(A40,Languages!$A$4:$I$273,3+$A$1)","v":"Gummilippe am Höhenbegrenzungsbalken"}]
[38,{"$f":"Languages!D41","v":"Height:\r(The car park should receive one point for each 10cm of height above 1.90m up to 2.20 m)"},{"$f":"VLOOKUP(A41,Languages!$A$4:$I$273,3+$A$1)","v":"Durchfahrtshöhe:\r(Das Parkhaus erhält 1 Punkt pro 10 cm Durchfahrtshöhe über 1,90 m und 2,20 m)"}]
[39,{"$f":"Languages!D42","v":"Traffic signs to define limitations in use of facility.\r• Clear signing = 3\r• Incomplete signing = 2\r• No signing = 0)"},{"$f":"VLOOKUP(A42,Languages!$A$4:$I$273,3+$A$1)","v":"Verkehrszeichen für Nutzungsbegrenzungen\r(vollständige und eindeutige Beschilderung = 3, Beschilderung unvollständig = 2, keine Beschilderung = 0)"}]
[40,{"$f":"Languages!D43","v":"Information on:"},{"$f":"VLOOKUP(A43,Languages!$A$4:$I$273,3+$A$1)","v":"Information bezüglich:"}]
[41,{"$f":"Languages!D44","v":"Operators terms & conditions within the car park:"},{"$f":"VLOOKUP(A44,Languages!$A$4:$I$273,3+$A$1)","v":"Einstellbedingungen des Betreibers innerhalb des Parkhauses"}]
[42,{"$f":"Languages!D45","v":"Daily opening hours:"},{"$f":"VLOOKUP(A45,Languages!$A$4:$I$273,3+$A$1)","v":"Öffnungszeiten"}]
[43,{"$f":"Languages!D46","v":"Scale of tariffs:"},{"$f":"VLOOKUP(A46,Languages!$A$4:$I$273,3+$A$1)","v":"Parktarife"}]
[44,{"$f":"Languages!D47","v":"Readibility of tariff system:"},{"$f":"VLOOKUP(A47,Languages!$A$4:$I$273,3+$A$1)","v":"Verständlichkeit der Parktarife"}]
[45,{"$f":"Languages!D48","v":"Design entry/exit area"},{"$f":"VLOOKUP(A48,Languages!$A$4:$I$273,3+$A$1)","v":"Bauliche Ausbildung der Ein-/Ausfahrt"}]
[46,{"$f":"Languages!D49","v":"Entry ticket- machine easy to reach:"},{"$f":"VLOOKUP(A49,Languages!$A$4:$I$273,3+$A$1)","v":"Einfahrt: Ticketgeber gut zu erreichen"}]
[47,{"$f":"Languages!D50","v":"Exit ticket- machine easy to reach:"},{"$f":"VLOOKUP(A50,Languages!$A$4:$I$273,3+$A$1)","v":"Ausfahrt: Ausfahrtskontrollgerät gut zu erreichen"}]
[48,{"$f":"Languages!D51","v":"Longitudinal slope at the ticket machines"},{"$f":"VLOOKUP(A51,Languages!$A$4:$I$273,3+$A$1)","v":"Längsgefälle im Bereich der Ticketgeber und Ausfahrtskontrollgeräte"}]
[49,{"$f":"Languages!D52","v":"Entry lane:\r• 0-2% (car doesn’t move without brake) = 1\r• 2-5% = 0\r• Above 5% = -1"},{"$f":"VLOOKUP(A52,Languages!$A$4:$I$273,3+$A$1)","v":"Einfart:\r(0-2% (das Fahrzeug bleibt auch ohne Bremse stehen) = 1, 2-5% = 0, über 5% = -1)"}]
[50,{"$f":"Languages!D53","v":"Exit lane:\r• 0-2% (car doesn’t move without brake) = 1\r• 2-5% = 0\r• Above 5% = -1"},{"$f":"VLOOKUP(A53,Languages!$A$4:$I$273,3+$A$1)","v":"Ausfahrt:\r(0-2% (das Fahrzeug bleibt auch ohne Bremse stehen) = 1, 2-5% = 0, über 5% = -1)"}]
[51,{"$f":"Languages!D54","v":"Kerb design to avoid damage to average vehicle’s wheels:\r(Yes = 2, No protection = 0, No kerbs in entry/exit area = 2)"},{"$f":"VLOOKUP(A54,Languages!$A$4:$I$273,3+$A$1)","v":"Schrammbordausbildung zum Schutz vor Beschädigung der Reifen und Felgen:\r(ja = 2, kein Schutz = 0, keine Schrammborde im Ein-Ausfahrtsbereich = 2)\r"}]
[52,{"$f":"Languages!D55","v":"Anti slip surfaces access/egress ramps:\r(Anti slip = 1, Slippery when wet = 0)"},{"$f":"VLOOKUP(A55,Languages!$A$4:$I$273,3+$A$1)","v":"Rutschfeste Oberfläche im Ein-/Ausfahrtsbereich:\r(rutschfest = 1, rutschig wenn nass = 0)"}]
[53,{"$f":"Languages!D56","v":"Access security"},{"$f":"VLOOKUP(A56,Languages!$A$4:$I$273,3+$A$1)","v":"Zugangskontrolle"}]
[54,{"$f":"Languages!D57","v":"Barrier"},{"$f":"VLOOKUP(A57,Languages!$A$4:$I$273,3+$A$1)","v":"Schranke"}]
[55,{"$f":"Languages!D58","v":"Intercom"},{"$f":"VLOOKUP(A58,Languages!$A$4:$I$273,3+$A$1)","v":"Sprechstelle"}]
[56,{"$f":"Languages!D59","v":"CCTV"},{"$f":"VLOOKUP(A59,Languages!$A$4:$I$273,3+$A$1)","v":"Videoüberwachung"}]
[57,{"$f":"Languages!D60","v":"Licence Plate Recognition"},{"$f":"VLOOKUP(A60,Languages!$A$4:$I$273,3+$A$1)","v":"Kennzeichenerkennung"}]
[58,{"$f":"Languages!D61","v":"Full height fast closing gates"},{"$f":"VLOOKUP(A61,Languages!$A$4:$I$273,3+$A$1)","v":"Schnelllauftore über die ganze Höhe"}]
[59,{"$f":"Languages!D62","v":"Staffed access(Entry or exit)"},{"$f":"VLOOKUP(A62,Languages!$A$4:$I$273,3+$A$1)","v":"Bemannte Einfahrt/Ausfahrt"}]
[60,{"$f":"Languages!D63","v":"Entry/Exit of the building: width between structure (per lane)\r(< 3 m =0, 3 – 3.3 m =1, > 3.3 m = 2)"},{"$f":"VLOOKUP(A63,Languages!$A$4:$I$273,3+$A$1)","v":"Durchfahrtsbreite zwischen Bauteilen im Bereich der Einfahrt/Ausfahrt\r(< 3 m =0, 3 – 3.3 m =1, > 3.3 m = 2)"}]
[61,{"$f":"Languages!D64","v":"Exit: exit slope ends at least 5 meters before crossing traffic (pedestrians/cyclists):"},{"$f":"VLOOKUP(A64,Languages!$A$4:$I$273,3+$A$1)","v":"Ausfahrt: die Gefällestrecke endet mindestens 5 m vor dem kreuzenden Verkehr (Fußgänger/Radfahrer)."}]
[62,{"$f":"Languages!D65","v":"subtotal  car entry/exit"},{"$f":"VLOOKUP(A65,Languages!$A$4:$I$273,3+$A$1)","v":"Zwischensumme Einfahrt/Ausfahrt"}]
[63,{"$f":"Languages!D66","v":"Parking Area"},{"$f":"VLOOKUP(A66,Languages!$A$4:$I$273,3+$A$1)","v":"Parkebenen"}]
[64,{"$f":"Languages!D67","v":"Pillar placement for at least 85% of bays:\r• does not intrude into the parking area = 8 \r• at beginning of stall = 0\r• next to car door = 0\r• at back of stall but intrudes into the parking area = 4"},{"$f":"VLOOKUP(A67,Languages!$A$4:$I$273,3+$A$1)","v":"Stützen im Bereich von mindestens 85 % der Stellplätze:\r(keine Beeinträchtigung des Stellplätze = 8, am Beginn der Stellplätze = 0, nahe der Fahrzeugtür = 0, am Ende aber mit Beeinträchtigung des Stellplatzes = 4)"}]
[65,{"$f":"Languages!D68","v":"Visibility (many/few dead corners, walls in the car park etc.)\rGood=4, Medium=2 or Bad=0"},{"$f":"VLOOKUP(A68,Languages!$A$4:$I$273,3+$A$1)","v":"Übersichtlichkeit (viele/wenige tote Winkel, Wände in der Parkebene,etc.)\rgut=4, mittel=2, schlecht=0"}]
[66,{"$f":"Languages!D69","v":"Signage for car driver:"},{"$f":"VLOOKUP(A69,Languages!$A$4:$I$273,3+$A$1)","v":"Beschilderung für den Fahrverkehr"}]
[67,{"$f":"Languages!D70","v":"Do traffic signs conform to national road code?"},{"$f":"VLOOKUP(A70,Languages!$A$4:$I$273,3+$A$1)","v":"Sind die Verkehrszeichen konform mit den nationalen Vorschriften?"}]
[68,{"$f":"Languages!D71","v":"Routing and turn signs: Is signage clear, complete and unambiguous? "},{"$f":"VLOOKUP(A71,Languages!$A$4:$I$273,3+$A$1)","v":"Wegweisung: Ist die Beschilderung leicht sichtbar, vollständig und unmissverständlich?"}]
[69,{"$f":"Languages!D72","v":"Complete ?"},{"$f":"VLOOKUP(A72,Languages!$A$4:$I$273,3+$A$1)","v":"Vollständig?"}]
[70,{"$f":"Languages!D73","v":"Easy to see ?"},{"$f":"VLOOKUP(A73,Languages!$A$4:$I$273,3+$A$1)","v":"Leicht zu sehen?"}]
[71,{"$f":"Languages!D74","v":"Unambiguous ?"},{"$f":"VLOOKUP(A74,Languages!$A$4:$I$273,3+$A$1)","v":"Unmissverständlich?"}]
[72,{"$f":"Languages!D75","v":"Exit signs in the car park: Is signage clear, complete and unambiguous? "},{"$f":"VLOOKUP(A75,Languages!$A$4:$I$273,3+$A$1)","v":"Ausfahrtsbeschilderung: Ist die Beschilderung leicht sichtbar, vollständig und unmissverständlich?"}]
[73,{"$f":"Languages!D76","v":"Complete ?"},{"$f":"VLOOKUP(A76,Languages!$A$4:$I$273,3+$A$1)","v":"Vollständig?"}]
[74,{"$f":"Languages!D77","v":"Easy to see ?"},{"$f":"VLOOKUP(A77,Languages!$A$4:$I$273,3+$A$1)","v":"Leicht zu sehen?"}]
[75,{"$f":"Languages!D78","v":"Unambiguous ?"},{"$f":"VLOOKUP(A78,Languages!$A$4:$I$273,3+$A$1)","v":"Unmissverständlich?"}]
[76,{"$f":"Languages!D79","v":"Parking bay marks"},{"$f":"VLOOKUP(A79,Languages!$A$4:$I$273,3+$A$1)","v":"Stellplatzmarkierung"}]
[77,{"$f":"Languages!D80","v":"Parking bays are clearly marked ?"},{"$f":"VLOOKUP(A80,Languages!$A$4:$I$273,3+$A$1)","v":"Sind die Stellplätze deutlich markiert?"}]
[78,{"$f":"Languages!D81","v":"Bay markings extend up walls to assist driver ?"},{"$f":"VLOOKUP(A81,Languages!$A$4:$I$273,3+$A$1)","v":"Sind die Markierungen bis auf die Wand verlängert um das Einparken zu erleichtern?"}]
[79,{"$f":"Languages!D82","v":"Are Road Markings:"},{"$f":"VLOOKUP(A82,Languages!$A$4:$I$273,3+$A$1)","v":"Sind die Fahrbahnmarkierungen:"}]
[80,{"$f":"Languages!D83","v":"Complete ?"},{"$f":"VLOOKUP(A83,Languages!$A$4:$I$273,3+$A$1)","v":"Vollständig?"}]
[81,{"$f":"Languages!D84","v":"Easy to see ?"},{"$f":"VLOOKUP(A84,Languages!$A$4:$I$273,3+$A$1)","v":"Leicht zu sehen?"}]
[82,{"$f":"Languages!D85","v":"Unambiguous ?"},{"$f":"VLOOKUP(A85,Languages!$A$4:$I$273,3+$A$1)","v":"Unmissverständlich?"}]
[83,{"$f":"Languages!D86","v":"Availability of spaces for disabled with wheelchair access anounced at the entrance the car park:"},{"$f":"VLOOKUP(A86,Languages!$A$4:$I$273,3+$A$1)","v":"Wird die Verfügbarkeit von Stellplätzen für Rollstuhlfahrer an der Einfahrt angezeigt?"}]
[84,{"$f":"Languages!D87","v":"Accessible for wheelchair ?"},{"$f":"VLOOKUP(A87,Languages!$A$4:$I$273,3+$A$1)","v":"Zugänglich für Rollstühle?"}]
[85,{"$f":"Languages!D88","v":"Bays minimum 3.5 m wide ?"},{"$f":"VLOOKUP(A88,Languages!$A$4:$I$273,3+$A$1)","v":"Sind die Plätze mindestens 3.50 m breit?"}]
[86,{"$f":"Languages!D89","v":"Close to pedestrian exit ?"},{"$f":"VLOOKUP(A89,Languages!$A$4:$I$273,3+$A$1)","v":"Sind sie Nahe am Ausgang?"}]
[87,{"$f":"Languages!D90","v":"Guidance to disabled spaces ?"},{"$f":"VLOOKUP(A90,Languages!$A$4:$I$273,3+$A$1)","v":"Gibt es eine Hinweisbeschilderung zu den Stellplätzen für Behinderte?"}]
[88,{"$f":"Languages!D91","v":"Parking angle at 85 % of bays:\r(Angle 76-90° = 0, Angle  45-75° = 2)"},{"$f":"VLOOKUP(A91,Languages!$A$4:$I$273,3+$A$1)","v":"Aufstellwinkel für 85% der Stellplätze (Winkel 76-90° = 0, Winkel  45-75° = 2)"}]
[89,{"$f":"Languages!D92","v":"Width of bays (85 % of bays), A or B: \rA: Parking angle 76 – 90 degrees\r(2.25m = -5, 2.30m = 0, 2.35m = 2, 2.40m = 4, 2.45m = 6, 2.50m = 8) \rB: Parking angle 45-75 degrees\r(2.25m = -5, 2.30m = 1, 2.35m = 3, 2.40m = 5, 2.45m = 8)\rWidth of 2.25m only applies for renovated car parks, new car parks must be minimum 2.30m"},{"$f":"VLOOKUP(A92,Languages!$A$4:$I$273,3+$A$1)","v":"Stellplatzbreite (85 % der Stellplätze), A oder B: \rA: Aufstellwinkel zwischen 76 – 90 Grad\r(2.25m = -5, 2.30m = 0, 2.35m = 2, 2.40m = 4, 2.45m = 6, 2.50m = 8) \rB: Aufstellwinkel zwischen 45-75 degrés\r(2.25m = -5, 2.30m = 1, 2.35m = 3, 2.40m = 5, 2.45m = 8)\rDie Breite von 2.25m ist nur bei über 10 Jahre alten renovierten Parkhäusern zulässig. Neue Parkhäuser müssen eine Stellplatzbreite von mindestens 2.30m aufweisen."}]
[90,{"$f":"Languages!D93","v":"Total unit measure of one way isle width and\rdepth of two parking bays, depending on parking angle and bay width:\rBay width: 2.50m / 2.45m / 2.40m / 2.35m / 2.30m\r90° :           16.00 /  16.30 /  16.60 /  16.90 / 17.30\r85° :           15.70 /  16.00 /  16.30 /  16.60 / 16.95\r80° :           15.40 /  15.70 /  16.00 /  16.30 / 16.60\r75° :           14.95 /  15.25 /  15.55 /  15.85 / 16.15\r70° :           14.50 /  14.80 /  15.10 /  15.40 / 15.70\r65° :           14.40 /  14.40 /  14.55 /  14.80 / 15.10\r60° :           14.30 /  14.30 /  14.30 /  14.30 / 14.50\r55° :           14.00 /  14.00 /  14.00 /  14.00 / 14.10\r50° :           13.75 /  13.75 /  13.75 /  13.75 / 13.75\r45° :           13.50 /  13.50 /  13.50 /  13.50 / 13.50\r\rTotal unit measure as above qualifies for 3 points. \rUp to 30 cm less qualifies for 2 points\rUp to 60 cm less qualifies for 1 point\rMore than 60 cm less: no points given"},{"$f":"VLOOKUP(A93,Languages!$A$4:$I$273,3+$A$1)","v":"Parkgassenbreite  (Fahrbahn plus 2 Stellplätze) in Abhängigkeit der Stellplatzbreite und des Aufstellwinkels:\rStellplatzbreite: 2.50m / 2.45m / 2.40m / 2.35m / 2.30m\r90° :                   16.00 /  16.30 /  16.60 /  16.90 / 17.30\r85° :                   15.70 /  16.00 /  16.30 /  16.60 / 16.95\r80° :                   15.40 /  15.70 /  16.00 /  16.30 / 16.60\r75° :                   14.95 /  15.25 /  15.55 /  15.85 / 16.15\r70° :                   14.50 /  14.80 /  15.10 /  15.40 / 15.70\r65° :                   14.40 /  14.40 /  14.55 /  14.80 / 15.10\r60° :                   14.30 /  14.30 /  14.30 /  14.30 / 14.50\r55° :                   14.00 /  14.00 /  14.00 /  14.00 / 14.10\r50° :                   13.75 /  13.75 /  13.75 /  13.75 / 13.75\r45° :                   13.50 /  13.50 /  13.50 /  13.50 / 13.50\r\rBreiten wie oben aufgeführt erhalten 3 Punkte. \rBreiten bis zu 30 cm weniger erhalten 2 Punkte\rBreiten bis zu 60 cm weniger erhalten 1 Punkte\rÜber 60 cm weniger: 0 Punkte\r"}]
[91,{"$f":"Languages!D94","v":"Kerb design to avoid damage to average vehicle’s wheels\r•  Yes = 2, No protection = 0"},{"$f":"VLOOKUP(A94,Languages!$A$4:$I$273,3+$A$1)","v":"Bauliche Ausbildung der Schrammborde zum Schutz vor Beschädigungen der Reifen und Felgen:\r•  Ja = 2, kein Schutz = 0"}]
[92,{"$f":"Languages!D95","v":"Vehicle Ramps"},{"$f":"VLOOKUP(A95,Languages!$A$4:$I$273,3+$A$1)","v":"Fahrzeugrampen"}]
[93,{"$f":"Languages!D96","v":"Is this a Single level car park without vehicular ramps or ramper floor?"},{"$f":"VLOOKUP(A96,Languages!$A$4:$I$273,3+$A$1)","v":"Handelt es sich um ein 1-geschossiges Parkhaus ohne Rampen oder geneigte Parkebenen?"}]
[94,{"$f":"Languages!D97","v":"Ramp surface between parking areas (Anti slip 1, Smooth 0, no ramps 1)"},{"$f":"VLOOKUP(A97,Languages!$A$4:$I$273,3+$A$1)","v":"Oberflächenausbildung der Rampe zwischen den Parkebenen (rutschhemmend 1; glatt 0, keine Rampen 1)"}]
[95,{"$f":"Languages!D98","v":"Ramp longitudinal gradient connecting ramps (not used for parking)\r•  <10%=3, 10-15%=1, >15%=0, no ramps=3"},{"$f":"VLOOKUP(A98,Languages!$A$4:$I$273,3+$A$1)","v":"Gefälle der Geschoßverbindungsrampen (keine Parkrampen)\r•  <10%=3, 10-15%=1, >15%=0, keine Rampen=3"}]
[96,{"$f":"Languages!D99","v":"Ramp width (between kerbs) all ramps measured at narrowest point "},{"$f":"VLOOKUP(A99,Languages!$A$4:$I$273,3+$A$1)","v":"Rampenbreite (zwischen Schrammborden), gemessen am engsten Punkt der Rampen"}]
[97,{"$f":"Languages!D100","v":"Curved ramps must be 1 m wider for same score. Are the ramps curbed?"},{"$f":"VLOOKUP(A100,Languages!$A$4:$I$273,3+$A$1)","v":"Gekrümmte Rampen müssen für dieselbe Punktzahl um 1m breiter sein? Sind die Rampen gekrümmt?"}]
[98,{"$f":"Languages!D101","v":"Please choose width. < 3m=0, 3-3.3m=1, >3.3m=2, no ramps=2"},{"$f":"VLOOKUP(A101,Languages!$A$4:$I$273,3+$A$1)","v":"Breite < 3m=0, 3-3.3m=1, >3.3m=2, keine Rampen=2"}]
[99,{"$f":"Languages!D102","v":"Ramp curvature (external radius) curved ramps\r•  up to 9m=0, 9–10 m=1, >10m=2, no ramps=2\rAt dual way ramps this measure refers to the inner lane."},{"$f":"VLOOKUP(A102,Languages!$A$4:$I$273,3+$A$1)","v":"Rampenradius (Außenradius)\r•  bis 9m=0, 9–10 m=1, >10m=2, keine Rampen=2\rBei mehrspurigen Rampen gelten diese Angaben für die innere Spur."}]
[100,{"$f":"Languages!D103","v":"Approach curve to straight ramps\r•  <7.5m=0, 7.5–9m=1, >9m=2, no ramps=2"},{"$f":"VLOOKUP(A103,Languages!$A$4:$I$273,3+$A$1)","v":"Eingangskurve zu geraden Rampen\r•  <7.5m=0, 7.5–9m=1, >9m=2, keine Rampen=2"}]
[101,{"$f":"Languages!D104","v":"Ramped parking floor longitudinal gradient\r•  <5%=3, 5-7 =1, >7%=0, no gradient=3"},{"$f":"VLOOKUP(A104,Languages!$A$4:$I$273,3+$A$1)","v":"Gefälle von Parkrampen (geneigte Parkebenen)\r•  <5%=3, 5-7 =1, >7%=0, kein Gefälle =3"}]
[102,{"$f":"Languages!D105","v":"Pedestrian Access"},{"$f":"VLOOKUP(A105,Languages!$A$4:$I$273,3+$A$1)","v":"Fußgängereingang"}]
[103,{"$f":"Languages!D106","v":"Item List"},{"$f":"VLOOKUP(A106,Languages!$A$4:$I$273,3+$A$1)","v":"Positionsliste"}]
[104,{"$f":"Languages!D107","v":"Headroom for pedestrians - excluding doors\r• <2.00m = 0\r• 2.00m – 2.10m = 1\r• 2.10m – 2.20m = 2\r• > 2.20m = 3"},{"$f":"VLOOKUP(A107,Languages!$A$4:$I$273,3+$A$1)","v":"Durchgangshöhe für Fußgänger (Türen ausgenommen)\r(<2.00m = 0, 2.00m – 2.10m = 1, 2.10m – 2.20m = 2, > 2.20m = 3)"}]
[105,{"$f":"Languages!D108","v":"Separate walking route (i.e. heightened; zebra stripes or colours) (yes = 2, no = 0)"},{"$f":"VLOOKUP(A108,Languages!$A$4:$I$273,3+$A$1)","v":"Ausgewiesene Fußwege (z.B.: baulich erhöht, Zebrastreifen oder farbig) (ja = 2, nein = 0)"}]
[106,{"$f":"Languages!D109","v":"Are pedestrian entrance doors easy to use?\r(Yes, automatic or open connection = 4, Easy to open = 2, No = 0)"},{"$f":"VLOOKUP(A109,Languages!$A$4:$I$273,3+$A$1)","v":"Sind die Türen für Fußgänger leicht zu öffnen ?\r(Ja, Automatiktüren oder offene Verbindung = 4, leicht zu öffnen = 2, nein = 0)"}]
[107,{"$f":"Languages!D110","v":"Pedestrian access controlled by ticket/pass card when car park open (Yes=1, No=0)"},{"$f":"VLOOKUP(A110,Languages!$A$4:$I$273,3+$A$1)","v":"Ist der Fußgängereingang auch während der Öffnungszeiten mit einem Kartenleser gesichert ? (Ja=2,Nein=0)"}]
[108,{"$f":"Languages!D111","v":"City plan a central location in car park:\r(On Every pedestrian exit = 2, One location = 1, No = 0)"},{"$f":"VLOOKUP(A111,Languages!$A$4:$I$273,3+$A$1)","v":"Liegt ein Stadtplan an einem zentralen Punkt des Parkhauses aus ?:\r(An jedem Fußgängerausgang= 2, An einer anderen Stelle = 1, Nein = 0)\r"}]
[109,{"$f":"Languages!D112","v":"Guidance:"},{"$f":"VLOOKUP(A112,Languages!$A$4:$I$273,3+$A$1)","v":"Wegweisung:"}]
[110,{"$f":"Languages!D113","v":"to key attractions around the car park at pedestrian exit (Yes=1, No=0):"},{"$f":"VLOOKUP(A113,Languages!$A$4:$I$273,3+$A$1)","v":"Zu wichtigen Zielen außerhalb des Parkhauses (Ja=1, Nein=0):"}]
[111,{"$f":"Languages!D114","v":"around the car park to pedestrian entrances (Yes=1, No=0):"},{"$f":"VLOOKUP(A114,Languages!$A$4:$I$273,3+$A$1)","v":"In der Umgebung des Parkhauses zu den Eingängen (Ja=1, Nein=0):"}]
[112,{"$f":"Languages!D115","v":"Is this a Single level car park at ground floor, (not open surface) ?"},{"$f":"VLOOKUP(A115,Languages!$A$4:$I$273,3+$A$1)","v":"Handelt es sich um ein 1-geschossiges Parkhaus auf Erdgeschoßniveau (keine offener Parkplatz)?"}]
[113,{"$f":"Languages!D116","v":"Is there elevators serving street level?"},{"$f":"VLOOKUP(A116,Languages!$A$4:$I$273,3+$A$1)","v":"Fahren der/die Aufzüge das Erdgeschoß/Straßenniveau an?"}]
[114,{"$f":"Languages!D117","v":"Number of Elevators at street level:\r(1 elevator = 1, 2 + elevators = 5)"},{"$f":"VLOOKUP(A117,Languages!$A$4:$I$273,3+$A$1)","v":"Anzahl der Aufzüge, welche das Erdgeschoß/Straßenniveau  anfahren:\r(1 Aufzug = 1, 2 Aufzüge oder mehr = 5)"}]
[115,{"$f":"Languages!D118","v":"Size of elevators:\r(More Than 8 people = 3, 4-8 people = 1, less than 4 = 0)"},{"$f":"VLOOKUP(A118,Languages!$A$4:$I$273,3+$A$1)","v":"Größe der Aufzüge:\r(über 8 Personen = 3, 4-8 Personen = 1, weniger als 4 Personen= 0)"}]
[116,{"$f":"Languages!D119","v":"Visibility from elevator inside to hall/parking area\r(no visibility from elevator = 0, glazed doors/walls = 3, no elevator = 0)"},{"$f":"VLOOKUP(A119,Languages!$A$4:$I$273,3+$A$1)","v":"Sichtverbindung zwischen Aufzug und Vorraum/Parkebene :\r(Keine Sichtverbindung = 0, Türen/Schachtwände verglast = 3, kein Aufzug = 0)"}]
[117,{"$f":"Languages!D120","v":"Level indication:"},{"$f":"VLOOKUP(A120,Languages!$A$4:$I$273,3+$A$1)","v":"Anzeige der Etage"}]
[118,{"$f":"Languages!D121","v":"in elevator:"},{"$f":"VLOOKUP(A121,Languages!$A$4:$I$273,3+$A$1)","v":"Im Aufzug"}]
[119,{"$f":"Languages!D122","v":"in elevator foyer:"},{"$f":"VLOOKUP(A122,Languages!$A$4:$I$273,3+$A$1)","v":"Im Aufzugvorraum"}]
[120,{"$f":"Languages!D123","v":"Elevator control buttons at wheelchair height\r•  Yes = 1, Other = 0"},{"$f":"VLOOKUP(A123,Languages!$A$4:$I$273,3+$A$1)","v":"Bedienelemente im Aufzug in behindertengerechter Höhe?\r•  Ja = 1, andere = 0"}]
[121,{"$f":"Languages!D124","v":"Doors directly to parking area"},{"$f":"VLOOKUP(A124,Languages!$A$4:$I$273,3+$A$1)","v":"Verbindungstüren zu den Parkebenen"}]
[122,{"$f":"Languages!D125","v":"Width (<90 cm =0, >=90 cm = 2)"},{"$f":"VLOOKUP(A125,Languages!$A$4:$I$273,3+$A$1)","v":"Lichte Breite (<90 cm =0, >=90 cm = 2)"}]
[123,{"$f":"Languages!D126","v":"Emergency door, standard open (Yes=2, No= 0)"},{"$f":"VLOOKUP(A126,Languages!$A$4:$I$273,3+$A$1)","v":"Fluchttüren, standardmässig offen (ja=2, nein= 0)"}]
[124,{"$f":"Languages!D127","v":"Visibility (Glazed door/wall = 3, No Glass = 0)"},{"$f":"VLOOKUP(A127,Languages!$A$4:$I$273,3+$A$1)","v":"Sichtbeziehung (verglaste Türen/Wände = 3, kein Glas = 0)"}]
[125,{"$f":"Languages!D128","v":"Are elevators the main vertical connection? (stairs only secondary or escape)"},{"$f":"VLOOKUP(A128,Languages!$A$4:$I$273,3+$A$1)","v":"Sind Aufzüge die wichtigste Geschoßverbindung? (Treppen nur zweitrangig oder zur Entfluchtung)"}]
[126,{"$f":"Languages!D129","v":"Stairwells (visibility and orientation)"},{"$f":"VLOOKUP(A129,Languages!$A$4:$I$273,3+$A$1)","v":"Treppenhäuser (Übersichtlichkeit und Orientierung)"}]
[127,{"$f":"Languages!D130","v":"Clear View (Yes = 1, No = 0, Irrelevant = 1)"},{"$f":"VLOOKUP(A130,Languages!$A$4:$I$273,3+$A$1)","v":"Übersichtlich  (ja= 1, nein = 0, unzutreffend = 1)"}]
[128,{"$f":"Languages!D131","v":"Level Indication (Yes = 1, No = 0, Irrelevant = 1)"},{"$f":"VLOOKUP(A131,Languages!$A$4:$I$273,3+$A$1)","v":"Geschoßkennzeichnung (ja = 1, nein = 0, unzutreffend = 1)"}]
[129,{"$f":"Languages!D132","v":"Stairs (incl. heightened visibility of steps)"},{"$f":"VLOOKUP(A132,Languages!$A$4:$I$273,3+$A$1)","v":"Treppen (einschließlich verbesserte Sichtbarkeit von Stufen)"}]
[130,{"$f":"Languages!D133","v":"Width (< 1.5 m = 0, > 1.5m = 2)"},{"$f":"VLOOKUP(A133,Languages!$A$4:$I$273,3+$A$1)","v":"Breite (< 1.5 m = 0, > 1.5m = 2)"}]
[131,{"$f":"Languages!D134","v":"Hand Rails (No hand rail =0, One Side = 1, Two sides=2)"},{"$f":"VLOOKUP(A134,Languages!$A$4:$I$273,3+$A$1)","v":"Handläufe (Kein Handlauf = 0, einseitig = 1, beidseitig = 2)"}]
[132,{"$f":"Languages!D135","v":"Heightened visibility of steps for people with poor eyesight (Yes = 2, No = 0)"},{"$f":"VLOOKUP(A135,Languages!$A$4:$I$273,3+$A$1)","v":"Verbesserte Sichtbarkeit von Stufen für Personen mit eingeschränkter Sehstärke (ja = 2, nein = 0)"}]
[133,{"$f":"Languages!D136","v":"Anti-slip surfacing on stairs: (Yes = 2, No = 0)"},{"$f":"VLOOKUP(A136,Languages!$A$4:$I$273,3+$A$1)","v":"Rutschfester Belag auf den Stufen (ja = 2, nein = 0)"}]
[134,{"$f":"Languages!D137","v":"External openings in stairwell\r(window/grilled to outside or car park  =2, none =0)"},{"$f":"VLOOKUP(A137,Languages!$A$4:$I$273,3+$A$1)","v":"Öffnungen in Treppenhauswänden\r(Fenster oder vergitterte Öffnungen ins Freie oder zu den Parkebenen = 2, keine Öffnungen = 0)"}]
[135,{"$f":"Languages!D138","v":"Security Equipment"},{"$f":"VLOOKUP(A138,Languages!$A$4:$I$273,3+$A$1)","v":"Sicherheitseinrichtungen"}]
[136,{"$f":"Languages!D139","v":"Item List"},{"$f":"VLOOKUP(A139,Languages!$A$4:$I$273,3+$A$1)","v":"Positionsliste"}]
[137,{"$f":"Languages!D140","v":"CCTV with notice at entrance = 3, No CCTV =0"},{"$f":"VLOOKUP(A140,Languages!$A$4:$I$273,3+$A$1)","v":"Videoüberwachung mit Ankündigung am Eingang = 3, Keine Videoüberwachung = 0"}]
[138,{"$f":"Languages!D141","v":"Staff surveillance (on-site or remote)\r•  Yes = 5, No = 0"},{"$f":"VLOOKUP(A141,Languages!$A$4:$I$273,3+$A$1)","v":"Überwachung durch Personal (vor Ort oder durch Fernüberwachung)\r•  ja = 5, nein = 0"}]
[139,{"$f":"Languages!D142","v":"CCTV at:"},{"$f":"VLOOKUP(A142,Languages!$A$4:$I$273,3+$A$1)","v":"Videoüberwachung an besonderen Stellen"}]
[140,{"$f":"Languages!D143","v":"Car Entry: Yes =1, No =0"},{"$f":"VLOOKUP(A143,Languages!$A$4:$I$273,3+$A$1)","v":"Einfahrt: ja = 1, nein = 0"}]
[141,{"$f":"Languages!D144","v":" Car Exit: Yes =1, No =0"},{"$f":"VLOOKUP(A144,Languages!$A$4:$I$273,3+$A$1)","v":"Ausfahrt: ja = 1, nein = 0"}]
[142,{"$f":"Languages!D145","v":"Pay Machine: Yes =1, No =0"},{"$f":"VLOOKUP(A145,Languages!$A$4:$I$273,3+$A$1)","v":"Kassenautomat: ja = 1, nein = 0"}]
[143,{"$f":"Languages!D146","v":"Elevator Hall, every level: Yes =1, No =0"},{"$f":"VLOOKUP(A146,Languages!$A$4:$I$273,3+$A$1)","v":"Aufzugvorraum, in allen Geschossen: ja = 1, nein = 0"}]
[144,{"$f":"Languages!D147","v":"Stairwells, every level: Yes =1, No =0"},{"$f":"VLOOKUP(A147,Languages!$A$4:$I$273,3+$A$1)","v":"Treppenhäuser, in allen Geschossen: ja = 1, nein = 0"}]
[145,{"$f":"Languages!D148","v":"Pedestrian Entrances: Yes =1, No =0"},{"$f":"VLOOKUP(A148,Languages!$A$4:$I$273,3+$A$1)","v":"Fußgängereingang: ja = 1, nein = 0"}]
[146,{"$f":"Languages!D149","v":"Most of Parking Area (65%):Yes =3, No =0"},{"$f":"VLOOKUP(A149,Languages!$A$4:$I$273,3+$A$1)","v":"Überwiegender Teil der Parkebenen (65%): ja = 3, nein = 0"}]
[147,{"$f":"Languages!D150","v":" Ramps: Yes = 1, No = 0"},{"$f":"VLOOKUP(A150,Languages!$A$4:$I$273,3+$A$1)","v":"Rampen: ja = 1, nein = 0"}]
[148,{"$f":"Languages!D151","v":"Staff contactable via:"},{"$f":"VLOOKUP(A151,Languages!$A$4:$I$273,3+$A$1)","v":"Personal kontaktierbar durch:"}]
[149,{"$f":"Languages!D152","v":"Intercom at pay machine and/or controlled entries (24/7=3, All access hours if not 24/7= 2, Part time/not available = 0)"},{"$f":"VLOOKUP(A152,Languages!$A$4:$I$273,3+$A$1)","v":"Sprechstellen an den Kassenautomaten und/oder an den kontrollierten Zugängen (24h/7=3, während der Öffnungszeiten wenn nicht 24h/24 = 2, zeitweise oder gar nicht = 0)"}]
[150,{"$f":"Languages!D153","v":"Emergency call system in parking area (24/7=3, All access hours if not 24/7= 2, Part time/not available = 0)"},{"$f":"VLOOKUP(A153,Languages!$A$4:$I$273,3+$A$1)","v":"Notrufmelder in den Parkebenen (24/7 = 3, während der Öffnungszeiten wenn nicht 24/7 = 2, zeitweise oder gar nicht = 0)"}]
[151,{"$f":"Languages!D154","v":"Recognizable staff present and patrolling car park\r(24/7 = 3, During access Hours = 2, Less than access Hours = 1, No = 0)"},{"$f":"VLOOKUP(A154,Languages!$A$4:$I$273,3+$A$1)","v":"Patroullierendes Parkhauspersonal anwesend\r(24/7 = 3, während der Öffnungszeiten wenn nicht 24/7 = 1, gar nicht = 0)"}]
[152,{"$f":"Languages!D155","v":"Lockable vehicle exit/entry: \r(Closed gate/rolling shutter  after access hours = 2, Secured: fast opening gate during day = 4, Secured: slow opening gate during day = 2, No provisions = 0)"},{"$f":"VLOOKUP(A155,Languages!$A$4:$I$273,3+$A$1)","v":"Verschließbare Ein-/Ausfahrten: \r(geschlossene Tore oder Rollgitter außerhalb der Öffnungszeiten = 2, Schnellauftore während der Öffnungszeiten = 4, langsam laufende Tore während der Öffnungszeiten = 2, keine Sicherung = 0)\r"}]
[153,{"$f":"Languages!D156","v":"Lockable pedestrian exit/entry (after opening hours).\r(Door/gate/rolling shutter <= 15cm maximum aperture = 2, over 15 cm = 0, no provisions = 0, Irrelevant (24 hours opening) = 2)"},{"$f":"VLOOKUP(A156,Languages!$A$4:$I$273,3+$A$1)","v":"Verschließbare Ein-/Ausgänge außerhalb der Öffnungszeiten: \r(Türen, Tore oder Rollgitter mit Öffnungen <= 15 cm = 2, > 15 cm = 0, keine Sicherung = 0, unzutreffend (24 Stunden Öffnungszeit) = 2)"}]
[154,{"$f":"Languages!D157","v":"Grilles on external openings & security grilles\r(<= 15 cm = 2, > 15 cm or no protection= 0, Irrelevant (no external openings) = 2)"},{"$f":"VLOOKUP(A157,Languages!$A$4:$I$273,3+$A$1)","v":"Vergitterung von Öffnungen nach außen\r(<= 15 cm = 2, > 15 cm oder kein Schutz= 0, unzutreffend (keine Öffnungen) = 2)"}]
[155,{"$f":"Languages!D158","v":"Wayfinding Inside and Outside"},{"$f":"VLOOKUP(A158,Languages!$A$4:$I$273,3+$A$1)","v":"Wegweisung innerhalb und außerhalb des Parkhauses"}]
[156,{"$f":"Languages!D159","v":"Item List"},{"$f":"VLOOKUP(A159,Languages!$A$4:$I$273,3+$A$1)","v":"Positionsliste"}]
[157,{"$f":"Languages!D160","v":"Identification of vacant parking spaces"},{"$f":"VLOOKUP(A160,Languages!$A$4:$I$273,3+$A$1)","v":"Anzeige von freien Stellplätzen"}]
[158,{"$f":"Languages!D161","v":"Parking floor level (yes/good = 2, no/bad = 0)"},{"$f":"VLOOKUP(A161,Languages!$A$4:$I$273,3+$A$1)","v":"Etagenweise (ja/gut = 2, nein/schlecht= 0)"}]
[159,{"$f":"Languages!D162","v":"Parking row (yes/good = 1, no/bad = 0)"},{"$f":"VLOOKUP(A162,Languages!$A$4:$I$273,3+$A$1)","v":"Gassenweise (ja/gut = 1, nein/schlecht= 0)"}]
[160,{"$f":"Languages!D163","v":"Individual stall indication (yes/good = 2, no/bad = 0)"},{"$f":"VLOOKUP(A163,Languages!$A$4:$I$273,3+$A$1)","v":"Platzweise (ja/gut = 2, nein/schlecht= 0)"}]
[161,{"$f":"Languages!D164","v":"Way finding (vehicles)"},{"$f":"VLOOKUP(A164,Languages!$A$4:$I$273,3+$A$1)","v":"Wegweisung für den fahrenden Verkehr"}]
[162,{"$f":"Languages!D165","v":"Are floors clearly and separately identified for drivers? (Good =3, Adequate =2, Poor =1, No =0)"},{"$f":"VLOOKUP(A165,Languages!$A$4:$I$273,3+$A$1)","v":"Sind die Etagen für den Fahrer klar und deutlich gekennzeichnet? (gut =3, befriedigend =2, schlecht =1, gar nicht =0)"}]
[163,{"$f":"Languages!D166","v":"Are sub-areas of floors clearly identified for drivers? (Good =3, Adequate =2, Poor =1, No =0)"},{"$f":"VLOOKUP(A166,Languages!$A$4:$I$273,3+$A$1)","v":"Sind einzelne Bereiche für den Fahrer klar und deutlich gekennzeichnet? (gut =3, befriedigend =2, schlecht =1, gar nicht =0)"}]
[164,{"$f":"Languages!D167","v":"Are fire escapes and escape routes clearly marked\r• Clear from all locations = 3\r• most locations= 2\r• some locations=1\r• No marking of escape routes=0)"},{"$f":"VLOOKUP(A167,Languages!$A$4:$I$273,3+$A$1)","v":"Sind die Notausgänge und Rettungswege klar und deutlich gekennzeichnet?\r(an allen Standorten = 3, an den meisten Standorten = 2, nur an einigen Standorten = 1, keine Kennzeichnung der Rettungswege = 0)"}]
[165,{"$f":"Languages!D168","v":"Are floor levels clearly marked?\r(good =3, adequate=2, poor=1, none =0. Single level car parks = 3)"},{"$f":"VLOOKUP(A168,Languages!$A$4:$I$273,3+$A$1)","v":"Sind die einzelnen Parkebenen klar und deutlich gekennzeichnet?\r(gut = 3, befriedigend = 2, schlecht = 1, gar nicht = 0., unzutreffend, da nur 1 Geschoss = 3)"}]
[166,{"$f":"Languages!D169","v":"Is there additional signing or prompts to orient the pedestrian on the parking deck\r(good =2, some =1, none = 0)"},{"$f":"VLOOKUP(A169,Languages!$A$4:$I$273,3+$A$1)","v":"Gibt es zusätzliche Schilder oder Anzeigen zur Verbesserung der Orientierung der Fußgänger?\r(gut = 2, einige = 1, keine = 0)"}]
[167,{"$f":"Languages!D170","v":"Are parking spaces individually numbered\r(Numbered including floor identification =2, Just numbers =1, none =0)"},{"$f":"VLOOKUP(A170,Languages!$A$4:$I$273,3+$A$1)","v":"Sind die Stellplätze einzeln nummeriert?\r(nummeriert mit Geschoßbezeichnung = 2, nur nummeriert = 1, nicht = 0)"}]
[168,{"$f":"Languages!D171","v":"Use of colours for  way finding\r(Yes= 1, No= 0)"},{"$f":"VLOOKUP(A171,Languages!$A$4:$I$273,3+$A$1)","v":"Verwendung von Farben zur Orientierung\r(ja = 1, nein = 0)"}]
[169,{"$f":"Languages!D172","v":"Guidance sign posting for cars on roads to car park"},{"$f":"VLOOKUP(A172,Languages!$A$4:$I$273,3+$A$1)","v":"Parkleitsystem"}]
[170,{"$f":"Languages!D173","v":"Static sign system only (Yes = 1, No = 0)"},{"$f":"VLOOKUP(A173,Languages!$A$4:$I$273,3+$A$1)","v":"Statisch (ja = 1, nein = 0)"}]
[171,{"$f":"Languages!D174","v":"Dynamic sign system additionally (Yes = 1, No = 0)"},{"$f":"VLOOKUP(A174,Languages!$A$4:$I$273,3+$A$1)","v":"Dynamisch (ja = 1, nein = 0)"}]
[172,{"$f":"Languages!D175","v":"Illuminated signage at car park entrance"},{"$f":"VLOOKUP(A175,Languages!$A$4:$I$273,3+$A$1)","v":"Beleuchtete Anzeige an der Einfahrt"}]
[173,{"$f":"Languages!D176","v":"Signal green arrow, red cross for direction (Yes = 1, No = 0)"},{"$f":"VLOOKUP(A176,Languages!$A$4:$I$273,3+$A$1)","v":"Grüner Pfeil/rotes Kreuz-Anzeige (ja = 1, nein = 0)"}]
[174,{"$f":"Languages!D177","v":"Signal full/free (Yes = 1, No = 0)"},{"$f":"VLOOKUP(A177,Languages!$A$4:$I$273,3+$A$1)","v":"Frei/Besetzt-Anzeige (ja = 1, nein = 0)"}]
[175,{"$f":"Languages!D178","v":"Signage at pedestrian entrance (Yes = 1, No = 0)"},{"$f":"VLOOKUP(A178,Languages!$A$4:$I$273,3+$A$1)","v":"Anzeige an den Fußgängerzugängen (ja = 1, nein = 0)"}]
[176,{"$f":"Languages!D179","v":"Comfort and Miscellaneous"},{"$f":"VLOOKUP(A179,Languages!$A$4:$I$273,3+$A$1)","v":"Komfort und verschiedenes"}]
[177,{"$f":"Languages!D180","v":"Notice-board at pedestrian entrance/exit showing:"},{"$f":"VLOOKUP(A180,Languages!$A$4:$I$273,3+$A$1)","v":"Hinweisschild an den Fußgängerzugängen bezüglich :"}]
[178,{"$f":"Languages!D181","v":"Access hours normal/special (yes = 1, no = 0)"},{"$f":"VLOOKUP(A181,Languages!$A$4:$I$273,3+$A$1)","v":"Öffnungszeiten übliche/besondere (ja = 1, nein = 0)"}]
[179,{"$f":"Languages!D182","v":"Readable & understandable tariff board (yes = 1, no = 0)"},{"$f":"VLOOKUP(A182,Languages!$A$4:$I$273,3+$A$1)","v":"Lesbare und verständliche Anzeige der Parktarife (ja = 1, nein = 0)"}]
[180,{"$f":"Languages!D183","v":"Operators terms and conditions (yes = 1, no = 0)"},{"$f":"VLOOKUP(A183,Languages!$A$4:$I$273,3+$A$1)","v":"Einstellbedingungen (ja = 1, nein = 0)"}]
[181,{"$f":"Languages!D184","v":"Payment options (pay at exit/pay at pay station):"},{"$f":"VLOOKUP(A184,Languages!$A$4:$I$273,3+$A$1)","v":"Bezahlmöglichkeiten (Zahlung am Ein-/Ausgang/am Kassenautomat):"}]
[182,{"$f":"Languages!D185","v":"Accepts coins? (yes =1, no =0)"},{"$f":"VLOOKUP(A185,Languages!$A$4:$I$273,3+$A$1)","v":"Münzzahlung? (ja = 1, nein = 0)"}]
[183,{"$f":"Languages!D186","v":"Change given? (yes =1, no =0)"},{"$f":"VLOOKUP(A186,Languages!$A$4:$I$273,3+$A$1)","v":"Wechselgeld? (ja = 1, nein = 0)"}]
[184,{"$f":"Languages!D187","v":"Accepts banknotes?  (yes =1, no =0)"},{"$f":"VLOOKUP(A187,Languages!$A$4:$I$273,3+$A$1)","v":"Banknoten?  (ja = 1, nein = 0)"}]
[185,{"$f":"Languages!D188","v":"Accepts bank cards?  (yes =1, no =0)"},{"$f":"VLOOKUP(A188,Languages!$A$4:$I$273,3+$A$1)","v":"Kreditkarten?  (ja = 1, nein = 0)"}]
[186,{"$f":"Languages!D189","v":"Payment by smart phone? (yes =1, no =0)"},{"$f":"VLOOKUP(A189,Languages!$A$4:$I$273,3+$A$1)","v":"Zahlung per Mobiltelefon? (ja = 1, nein = 0)"}]
[187,{"$f":"Languages!D190","v":"Payment by card/phone at exit? (yes =1, no =0)"},{"$f":"VLOOKUP(A190,Languages!$A$4:$I$273,3+$A$1)","v":"Karten-/Handyzahlung am Ausgang? (ja = 1, nein = 0)"}]
[188,{"$f":"Languages!D191","v":"ID & payment by LPR? (yes =1, no =0)"},{"$f":"VLOOKUP(A191,Languages!$A$4:$I$273,3+$A$1)","v":"Identifikation und Zahlung per Kennzeichenerkennung? (ja = 1, nein = 0)"}]
[189,{"$f":"Languages!D192","v":"Accepts other cards: How many? (1 point per additional option up to 3)"},{"$f":"VLOOKUP(A192,Languages!$A$4:$I$273,3+$A$1)","v":"Akzeptanz anderer Karten: Wie viele? (1 Punkt je zusätzlicher Option bis 3 Punkte)"}]
[190,{"$f":"Languages!D193","v":"Payment at staffed desk: (yes = 1, no = 0)"},{"$f":"VLOOKUP(A193,Languages!$A$4:$I$273,3+$A$1)","v":"Zahlung an besetzter Kasse: (ja = 1, nein = 0)"}]
[191,{"$f":"Languages!D194","v":"Is this a Pay and Display Car Park?"},{"$f":"VLOOKUP(A194,Languages!$A$4:$I$273,3+$A$1)","v":"Handelt es sich um ein Parkhaus ohne Schranken? (mit Parkscheinautomaten)?"}]
[192,{"$f":"Languages!D195","v":"Number of Pay points for Barrier controlled car parks:\r(One pay station = 0,  More than one =1, One at each pedestrian entrance, excluding fire escapes =2, More than one at each pedestrian entrance =3)"},{"$f":"VLOOKUP(A195,Languages!$A$4:$I$273,3+$A$1)","v":"Anzahl der Bezahlstationen für beschrankte Parkhäuser:\r(eine = 0, mehr als eine = 1, eine an jedem Fußgängerzugang (außer Notausgänge) = 2, eine an jedem Fußgängerzugang = 3)"}]
[193,{"$f":"Languages!D196","v":"Number of Pay points for Pay and Display Car Parks\r(One =0, < 1 for every 50 spaces =2, >1 for every 50 spaces =3)"},{"$f":"VLOOKUP(A196,Languages!$A$4:$I$273,3+$A$1)","v":"Anzahl der Parkscheinautomaten für unbeschrankte Parkhäuser:\r(einer = 0, weniger als einer pro 50 Stellplätze = 1, mehr als einer pro 50 Stellplätze = 3)"}]
[194,{"$f":"Languages!D197","v":"Customer toilets:"},{"$f":"VLOOKUP(A197,Languages!$A$4:$I$273,3+$A$1)","v":"Öffentliche Toiletten:"}]
[195,{"$f":"Languages!D198","v":"Exist? (yes= 2, no= 0)"},{"$f":"VLOOKUP(A198,Languages!$A$4:$I$273,3+$A$1)","v":"Vorhanden? (ja = 2, nein = 0)"}]
[196,{"$f":"Languages!D199","v":"Disabled toilet? (yes=1, no= 0)"},{"$f":"VLOOKUP(A199,Languages!$A$4:$I$273,3+$A$1)","v":"Behindertentoilette? (ja = 1, nein = 0)"}]
[197,{"$f":"Languages!D200","v":"unisex = 0, male/female separated = 1"},{"$f":"VLOOKUP(A200,Languages!$A$4:$I$273,3+$A$1)","v":"Toiletten unisex= 0, Frauen/Männer getrennt = 1"}]
[198,{"$f":"Languages!D201","v":"attendant: yes=1, no= 0"},{"$f":"VLOOKUP(A201,Languages!$A$4:$I$273,3+$A$1)","v":"Toilettenaufseher(-in): ja = 1, nein = 0"}]
[199,{"$f":"Languages!D202","v":"Use of colours/ embellishing works"},{"$f":"VLOOKUP(A202,Languages!$A$4:$I$273,3+$A$1)","v":"Verwendung von Farben / Verschönerungen"}]
[200,{"$f":"Languages!D203","v":"Coloured pillars =1, no/concrete grey = 0"},{"$f":"VLOOKUP(A203,Languages!$A$4:$I$273,3+$A$1)","v":"Farbige Stützen = 1, nein, betongrau = 0"}]
[201,{"$f":"Languages!D204","v":"Coloured walls =1, no/concrete grey = 0"},{"$f":"VLOOKUP(A204,Languages!$A$4:$I$273,3+$A$1)","v":"Farbige Wände = 1, nein, betongrau = 0"}]
[202,{"$f":"Languages!D205","v":"Extra embellishment"},{"$f":"VLOOKUP(A205,Languages!$A$4:$I$273,3+$A$1)","v":"Besondere verschönernde Elemente:"}]
[203,{"$f":"Languages!D206","v":" Artwork: (Yes = 2, No = 0)"},{"$f":"VLOOKUP(A206,Languages!$A$4:$I$273,3+$A$1)","v":"Kunstwerke: (ja = 2, nein = 0)"}]
[204,{"$f":"Languages!D207","v":"Planters: (Yes = 1, No = 0)"},{"$f":"VLOOKUP(A207,Languages!$A$4:$I$273,3+$A$1)","v":"Pflanzen: (ja = 1, nein = 0)"}]
[205,{"$f":"Languages!D208","v":"Other: (Yes = 1, No = 0)"},{"$f":"VLOOKUP(A208,Languages!$A$4:$I$273,3+$A$1)","v":"Sonstiges: (ja = 1, nein = 0)"}]
[206,{"$f":"Languages!D209","v":"Mobile phone coverage (Yes = 2, No = 0)"},{"$f":"VLOOKUP(A209,Languages!$A$4:$I$273,3+$A$1)","v":"Handyempfang (ja = 2, nein = 0)"}]
[207,{"$f":"Languages!D210","v":"Continuity of radio signals (Yes = 1, No = 0)"},{"$f":"VLOOKUP(A210,Languages!$A$4:$I$273,3+$A$1)","v":"Radioemfang (ja = 1, nein = 0)"}]
[208,{"$f":"Languages!D211","v":"Music"},{"$f":"VLOOKUP(A211,Languages!$A$4:$I$273,3+$A$1)","v":"Musik"}]
[209,{"$f":"Languages!D212","v":"Background music: yes = 2, No = 0"},{"$f":"VLOOKUP(A212,Languages!$A$4:$I$273,3+$A$1)","v":"Hintergrundmusik:  ja = 2, nein = 0"}]
[210,{"$f":"Languages!D213","v":"Differentiation for way finding :  yes =1, No = 0"},{"$f":"VLOOKUP(A213,Languages!$A$4:$I$273,3+$A$1)","v":"Maßnahmen zur Erleichterung der Orientierung im Parkhaus:  ja = 1, nein = 0"}]
[211,{"$f":"Languages!D214","v":"Energy and Environment"},{"$f":"VLOOKUP(A214,Languages!$A$4:$I$273,3+$A$1)","v":"Energie und Umwelt"}]
[212,{"$f":"Languages!D215","v":"Energy Saving Lighting Systems"},{"$f":"VLOOKUP(A215,Languages!$A$4:$I$273,3+$A$1)","v":"Energiesparende Beleuchtung"}]
[213,{"$f":"Languages!D216","v":"Power Factor Compensation (Yes=1, No=0)"},{"$f":"VLOOKUP(A216,Languages!$A$4:$I$273,3+$A$1)","v":"Elektronische Vorschaltgeräte (EVG) (ja = 1, nein = 0)"}]
[214,{"$f":"Languages!D217","v":"Other Systems (Yes=1, No=0)"},{"$f":"VLOOKUP(A217,Languages!$A$4:$I$273,3+$A$1)","v":"Andere Systeme (ja = 1, nein = 0)"}]
[215,{"$f":"Languages!D218","v":"Movement detection variable lights, remaining quality (yes= 2, no= 0)"},{"$f":"VLOOKUP(A218,Languages!$A$4:$I$273,3+$A$1)","v":"Bewegungsgesteuerte Beleuchtung (ja = 2, nein = 0)"}]
[216,{"$f":"Languages!D219","v":"Adaptable lighting for daylight compensation at entrance area \r(yes= 2, no= 0)"},{"$f":"VLOOKUP(A219,Languages!$A$4:$I$273,3+$A$1)","v":"Adaptionsstrecke an der Einfahrt.\r(ja = 2, nein = 0)"}]
[217,{"$f":"Languages!D220","v":"Adaptable lighting for ambient light conditions at parking floor from daylight\r(yes= 2, no= 0, Irrelevant (below ground) =2)"},{"$f":"VLOOKUP(A220,Languages!$A$4:$I$273,3+$A$1)","v":"An das Tageslicht anpassbare Beleuchtung der Parkebenen (z.B. Dämmerungsschalter)\r(ja = 2, nein = 0, unzutreffend (Tiefgarage) = 2)"}]
[218,{"$f":"Languages!D221","v":"Solar panels on the roof or other green energy initiatives (yes= 2, no= 0)"},{"$f":"VLOOKUP(A221,Languages!$A$4:$I$273,3+$A$1)","v":"Photovoltaik oder andere umweltfreundliche energetische Initiativen (ja = 2, nein = 0)"}]
[219,{"$f":"Languages!D222","v":"Special treatment of cleaning water:\r•  yes= 2, no= 0"},{"$f":"VLOOKUP(A222,Languages!$A$4:$I$273,3+$A$1)","v":"Spezielle Behandlung von Schmutzwasser:\r•  ja = 2, nein = 0"}]
[220,{"$f":"Languages!D223","v":"Grey water or re-use of rain water\r•  yes= 2, no= 0\r"},{"$f":"VLOOKUP(A223,Languages!$A$4:$I$273,3+$A$1)","v":"Verwendung von Regenwasser als Brauchwasser (z.B. zur Reinigung oder Toilettenspülung)\r•  ja = 2, nein = 0"}]
[221,{"$f":"Languages!D224","v":"Electric Vehicles recharging points: (Yes, more than one= 2, One recharging point=1, None=0)"},{"$f":"VLOOKUP(A224,Languages!$A$4:$I$273,3+$A$1)","v":"Ladestationen für Elektrofahrzeuge: (ja, mehrere = 2, eine = 1, keine = 0)"}]
[222,{"$f":"Languages!D225","v":"Car sharing and similar initiatives\r•  yes= 2, no= 0"},{"$f":"VLOOKUP(A225,Languages!$A$4:$I$273,3+$A$1)","v":"Car Sharing oder ähnliche Angebote\r•  ja = 2, nein = 0"}]
[223,{"$f":"Languages!D226","v":"Other environmental or zero emission  initiatives\r•  yes= 2, no= 0"},{"$f":"VLOOKUP(A226,Languages!$A$4:$I$273,3+$A$1)","v":"Andere umweltfreundliche Initiativen, z.B. zur CO²-Reduzierung\r•  ja = 2, nein = 0"}]
[224,{"$f":"Languages!D227","v":"Minus Points"},{"$f":"VLOOKUP(A227,Languages!$A$4:$I$273,3+$A$1)","v":"Minuspunkte"}]
[225,{"$f":"Languages!D228","v":"Presence of Graffiti"},{"$f":"VLOOKUP(A228,Languages!$A$4:$I$273,3+$A$1)","v":"Vorhandensein von Graffiti in den:"}]
[226,{"$f":"Languages!D229","v":"Stairwells (Yes= -2, No= 0)"},{"$f":"VLOOKUP(A229,Languages!$A$4:$I$273,3+$A$1)","v":"Treppenhäusern (ja = -2, nein = 0)"}]
[227,{"$f":"Languages!D230","v":"Elevator (Yes= -2, No= 0)"},{"$f":"VLOOKUP(A230,Languages!$A$4:$I$273,3+$A$1)","v":"Aufzügen (ja = -2, nein = 0)"}]
[228,{"$f":"Languages!D231","v":"Toilets (Yes= -2, No= 0)"},{"$f":"VLOOKUP(A231,Languages!$A$4:$I$273,3+$A$1)","v":"Toiletten (ja = -2, nein = 0)"}]
[229,{"$f":"Languages!D232","v":"Parking area (Yes= -2, No= 0)"},{"$f":"VLOOKUP(A232,Languages!$A$4:$I$273,3+$A$1)","v":"Parkebenen (ja = -2, nein = 0)"}]
[230,{"$f":"Languages!D233","v":"Outside walls (Yes= -2, No= 0)"},{"$f":"VLOOKUP(A233,Languages!$A$4:$I$273,3+$A$1)","v":"Außenwände (ja = -2, nein = 0)"}]
[231,{"$f":"Languages!D234","v":"Presence of dirt"},{"$f":"VLOOKUP(A234,Languages!$A$4:$I$273,3+$A$1)","v":"Vorhandensein von Schmutz in den"}]
[232,{"$f":"Languages!D235","v":"Stairwells (Yes= -2, No= 0)"},{"$f":"VLOOKUP(A235,Languages!$A$4:$I$273,3+$A$1)","v":"Treppenhäusern (ja = -2, nein = 0)"}]
[233,{"$f":"Languages!D236","v":"Elevator (Yes= -2, No= 0)"},{"$f":"VLOOKUP(A236,Languages!$A$4:$I$273,3+$A$1)","v":"Aufzügen (ja = -2, nein = 0)"}]
[234,{"$f":"Languages!D237","v":"Toilets (Yes= -2, No= 0)"},{"$f":"VLOOKUP(A237,Languages!$A$4:$I$273,3+$A$1)","v":"Toiletten (ja = -2, nein = 0)"}]
[235,{"$f":"Languages!D238","v":"Parking area (Yes= -2, No= 0)"},{"$f":"VLOOKUP(A238,Languages!$A$4:$I$273,3+$A$1)","v":"Parkebenen (ja = -2, nein = 0)"}]
[236,{"$f":"Languages!D239","v":"Outside of entrance for pedestrians + cars (Yes= -2, No= 0)"},{"$f":"VLOOKUP(A239,Languages!$A$4:$I$273,3+$A$1)","v":"Vor den Eingängen und Einfahrten (ja = -2, nein = 0)"}]
[237,{"$f":"Languages!D240","v":"Poor quality of paint work"},{"$f":"VLOOKUP(A240,Languages!$A$4:$I$273,3+$A$1)","v":"Schlechte Qualität von Anstrichen in den"}]
[238,{"$f":"Languages!D241","v":"Stairwells (Yes= -2, No= 0)"},{"$f":"VLOOKUP(A241,Languages!$A$4:$I$273,3+$A$1)","v":"Treppenhäusern (ja = -2, nein = 0)"}]
[239,{"$f":"Languages!D242","v":"Elevator (Yes= -2, No= 0)"},{"$f":"VLOOKUP(A242,Languages!$A$4:$I$273,3+$A$1)","v":"Aufzügen (ja = -2, nein = 0)"}]
[240,{"$f":"Languages!D243","v":"Parking area (Yes= -2, No= 0)"},{"$f":"VLOOKUP(A243,Languages!$A$4:$I$273,3+$A$1)","v":"Parkebenen (ja = -2, nein = 0)"}]
[241,{"$f":"Languages!D244","v":"Poor quality horizontal markings (Yes= -2, No= 0)"},{"$f":"VLOOKUP(A244,Languages!$A$4:$I$273,3+$A$1)","v":"Schlechte Qualität der Bodenmarkierungen (ja = 2, nein = 0)"}]
[242,{"$f":"Languages!D245","v":"Poor quality/lack of maintenance (pot holes ,damages) "},{"$f":"VLOOKUP(A245,Languages!$A$4:$I$273,3+$A$1)","v":"Mangelhafte Instandhaltung (Schlaglöcher, bauliche Mängel, etc.) "}]
[243,{"$f":"Languages!D246","v":"Floors (Yes= -2, No= 0)"},{"$f":"VLOOKUP(A246,Languages!$A$4:$I$273,3+$A$1)","v":"Boden (ja = -2, nein = 0)"}]
[244,{"$f":"Languages!D247","v":"Walls (Yes= -2, No= 0)"},{"$f":"VLOOKUP(A247,Languages!$A$4:$I$273,3+$A$1)","v":"Wänden (ja = -2, nein = 0)"}]
[245,{"$f":"Languages!D248","v":"Evidence of standing water (Yes= -2, No= 0)"},{"$f":"VLOOKUP(A248,Languages!$A$4:$I$273,3+$A$1)","v":"Vorhandensein von Pfützen (ja = -2, nein = 0)"}]
[246,{"$f":"Languages!D249","v":"Evidence of bad smells"},{"$f":"VLOOKUP(A249,Languages!$A$4:$I$273,3+$A$1)","v":"Vorhandensein von üblen Gerüchen in den"}]
[247,{"$f":"Languages!D250","v":"Elevators (Yes= -2, No= 0)"},{"$f":"VLOOKUP(A250,Languages!$A$4:$I$273,3+$A$1)","v":"Aufzügen (ja = -2, nein = 0)"}]
[248,{"$f":"Languages!D251","v":"Stairwells (Yes= -2, No= 0)"},{"$f":"VLOOKUP(A251,Languages!$A$4:$I$273,3+$A$1)","v":"Treppenhäusern (ja = -2, nein = 0)"}]
[249,{"$f":"Languages!D252","v":"Parking deck (Yes= -2, No= 0)"},{"$f":"VLOOKUP(A252,Languages!$A$4:$I$273,3+$A$1)","v":"Parkebenen (ja = -2, nein = 0)"}]
[250,{"$f":"Languages!D253","v":"Over 15% of parking spaces in cul-de-sac without occupancy indication. (Yes= -5, No=0)"},{"$f":"VLOOKUP(A253,Languages!$A$4:$I$273,3+$A$1)","v":"Über 15% der Stellplätze in Sackgassen ohne Anzeige der Belegung (ja = 5, nein = 0)"}]
[251,{"$f":"Languages!D254","v":"Various points of criticism (to explain!)\r[E.g. hollow sound, squeaking tyres, unintended visitors, etc.] up to -10"},{"$f":"VLOOKUP(A254,Languages!$A$4:$I$273,3+$A$1)","v":"Verschiedene Kritikpunkte (zu erläutern!)\r[z.B.: Lärm, quietschende Reifen, unerwünschtes Publikum, etc.] bis zu-10 Pkt."}]
[252,{"$f":"Languages!D255","v":"Penalty for Mandatory Condition 1.4 Applies"},{"$f":"VLOOKUP(A255,Languages!$A$4:$I$273,3+$A$1)","v":"Strafabzug für Mindestanforderung 1.4 kommt zur Anwendung."}]
[253,{"$f":"Languages!D256","v":"Bonus Points"},{"$f":"VLOOKUP(A256,Languages!$A$4:$I$273,3+$A$1)","v":"Bonuspunkte"}]
[254,{"$f":"Languages!D257","v":"Extra provisions in car park"},{"$f":"VLOOKUP(A257,Languages!$A$4:$I$273,3+$A$1)","v":"Zusätzliche Einrichtungen im Parkhaus:"}]
[255,{"$f":"Languages!D258","v":"Special motorcycle area (Yes= 1, No= 0)"},{"$f":"VLOOKUP(A258,Languages!$A$4:$I$273,3+$A$1)","v":"Motorradstellplätze (ja = 1, nein = 0)"}]
[256,{"$f":"Languages!D259","v":"Lockers for customers’ use (Yes= 1, No= 0)"},{"$f":"VLOOKUP(A259,Languages!$A$4:$I$273,3+$A$1)","v":"Schließfächer (ja = 1, nein = 0)"}]
[257,{"$f":"Languages!D260","v":"Other aids (Yes= 1, No= 0)"},{"$f":"VLOOKUP(A260,Languages!$A$4:$I$273,3+$A$1)","v":"Andere Angebote (ja = 1, nein = 0)"}]
[258,{"$f":"Languages!D261","v":"Bicycle rent (Yes= 1, No= 0)"},{"$f":"VLOOKUP(A261,Languages!$A$4:$I$273,3+$A$1)","v":"Fahrradverleih (ja = 1, nein = 0)"}]
[259,{"$f":"Languages!D262","v":"Other Driver Assistance (Yes= 1, No= 0)"},{"$f":"VLOOKUP(A262,Languages!$A$4:$I$273,3+$A$1)","v":"Andere Fahrerservices (ja = 1, nein = 0)"}]
[260,{"$f":"Languages!D263","v":"Vending Machines (Yes= 1, No= 0)"},{"$f":"VLOOKUP(A263,Languages!$A$4:$I$273,3+$A$1)","v":"Verkaufsautomaten (ja = 1, nein = 0)"}]
[261,{"$f":"Languages!D264","v":"Heart Defibrillator (Yes= 1, No= 0)"},{"$f":"VLOOKUP(A264,Languages!$A$4:$I$273,3+$A$1)","v":"Defibrillator (ja = 1, nein = 0)"}]
[262,{"$f":"Languages!D265","v":"First aid trained staff (Yes= 1, No= 0)"},{"$f":"VLOOKUP(A265,Languages!$A$4:$I$273,3+$A$1)","v":"Personal mit Erste-Hilfe-Ausbildung (ja = 1, nein = 0)"}]
[263,{"$f":"Languages!D266","v":"Real time traffic data (Yes= 1, No= 0)"},{"$f":"VLOOKUP(A266,Languages!$A$4:$I$273,3+$A$1)","v":"Echtzeit-Verkehrsinformationen (ja = 1, nein = 0)"}]
[264,{"$f":"Languages!D267","v":"Other real time accessible information (e.g. local events) (Yes= 1, No= 0)"},{"$f":"VLOOKUP(A267,Languages!$A$4:$I$273,3+$A$1)","v":"Andere aktuelle Informationen  (z.B. lokale Veranstaltungen) (ja = 1, nein = 0)"}]
[265,{"$f":"Languages!D268","v":"Measures to avoid traffic queues at peak hours (i.e. tidal lane at car entry/exit) - (Yes= 3, No= 0)"},{"$f":"VLOOKUP(A268,Languages!$A$4:$I$273,3+$A$1)","v":"Maßnahmen zur Verbesserung des Verkehrsablaufes in Spitzenstunden (z.B. tageszeitlich wechselnde Ein-/Ausfahrtsspuren) - (ja = 3, nein = 0)"}]
[266,{"$f":"Languages!D269","v":"Turn around possibility for cars before height barrier or full sign to prevent reversing (Yes= 3, No= 0)"},{"$f":"VLOOKUP(A269,Languages!$A$4:$I$273,3+$A$1)","v":"Wendemöglichkeit für Fahrzeuge vor der Höhenbegrenzung oder besondere Anzeigen zur Vermeidung von Rückwärtsfahrten  (ja = 3, nein = 0)"}]
[267,{"$f":"Languages!D270","v":"Customer service desk (Yes= 1, No= 0)"},{"$f":"VLOOKUP(A270,Languages!$A$4:$I$273,3+$A$1)","v":"Parkhausaufsicht mit Bedientresen (ja = 1, nein = 0)"}]
[268,{"$f":"Languages!D271","v":"Escalators and/or travellators\r(To/from all levels =5, To/from some levels =3, No Escalators or Travellators = 0)"},{"$f":"VLOOKUP(A271,Languages!$A$4:$I$273,3+$A$1)","v":"Rolltreppen oder Rollsteige\r(von/zu allen Etagen = 5, nur zu bestimmten Etagen = 3, keine Rolltreppen oder Rollsteige = 0)"}]
[269,{"$f":"Languages!D272","v":"Localisation of parked cars by ticket or license plate\r(Yes= 1, No= 0)"},{"$f":"VLOOKUP(A272,Languages!$A$4:$I$273,3+$A$1)","v":"Lokalisierung von Fahrzeugen durch den Parkschein oder das Fahrzeugkennzeichen\r(ja = 1, nein = 0)"}]
[270,{"$f":"Languages!D273","v":"Other positive points e.g. extra services, friendly staff, tiled walls/floors, good fit of the car park in cityscape etc up to ten additional bonus points. To be explicitly identified."},{"$f":"VLOOKUP(A273,Languages!$A$4:$I$273,3+$A$1)","v":"Andere positive Punkte oder Zusatzleistungen, wie freundliches Personal, gekachelte Wände/Böden, gutes Einfügen des Parkhauses in das Stadtbild usw. (zu beschreiben). (bis zu 10 Punkte)."}]
[]
["TAB: Options"]
[1,"Morning",{"$f":"VLOOKUP(A276,Options!$A$4:$I$273,3+$A$1)","v":"Morgen"}]
[2,"Afternoon",{"$f":"VLOOKUP(A277,Options!$A$4:$I$273,3+$A$1)","v":"Nachmittag"}]
[3,"Evening",{"$f":"VLOOKUP(A278,Options!$A$4:$I$273,3+$A$1)","v":"Abend"}]
[4]
[5,"Sunny",{"$f":"VLOOKUP(A280,Options!$A$4:$I$273,3+$A$1)","v":"sonnig"}]
[6,"Cloudy",{"$f":"VLOOKUP(A281,Options!$A$4:$I$273,3+$A$1)","v":"bewölkt"}]
[7,"Rain",{"$f":"VLOOKUP(A282,Options!$A$4:$I$273,3+$A$1)","v":"Regen"}]
[8,"Dusk",{"$f":"VLOOKUP(A283,Options!$A$4:$I$273,3+$A$1)","v":"Dämmerung"}]
[9,"Night",{"$f":"VLOOKUP(A284,Options!$A$4:$I$273,3+$A$1)","v":"Nacht"}]
[10]
[11," > 75%",{"$f":"VLOOKUP(A286,Options!$A$4:$I$273,3+$A$1)","v":" > 75%"}]
[12," 50% - 75%",{"$f":"VLOOKUP(A287,Options!$A$4:$I$273,3+$A$1)","v":" 50% - 75%"}]
[13," about 50%",{"$f":"VLOOKUP(A288,Options!$A$4:$I$273,3+$A$1)","v":"etwa 50%"}]
[14," 25% - 50%  ",{"$f":"VLOOKUP(A289,Options!$A$4:$I$273,3+$A$1)","v":" 25% - 50%"}]
[15,"< 25%",{"$f":"VLOOKUP(A290,Options!$A$4:$I$273,3+$A$1)","v":"< 25%"}]
[16]
[17,"OK",{"$f":"VLOOKUP(A292,Options!$A$4:$I$273,3+$A$1)","v":"OK"}]
[18,"Fail",{"$f":"VLOOKUP(A293,Options!$A$4:$I$273,3+$A$1)","v":"Mangel"}]
[19]
[20,"Yes",{"$f":"VLOOKUP(A295,Options!$A$4:$I$273,3+$A$1)","v":"Ja"}]
[21,"No",{"$f":"VLOOKUP(A296,Options!$A$4:$I$273,3+$A$1)","v":"Nein"}]
[22,"Irrelevant",{"$f":"VLOOKUP(A297,Options!$A$4:$I$273,3+$A$1)","v":"unzutreffend"}]
[23,"Clear signing",{"$f":"VLOOKUP(A298,Options!$A$4:$I$273,3+$A$1)","v":"verständliche Beschilderung"}]
[24,"Incomplete signing",{"$f":"VLOOKUP(A299,Options!$A$4:$I$273,3+$A$1)","v":"unvollständige Beschilderung"}]
[25,"No signing",{"$f":"VLOOKUP(A300,Options!$A$4:$I$273,3+$A$1)","v":"keine Beschilderung"}]
[26]
[27,"0%-2%",{"$f":"VLOOKUP(A302,Options!$A$4:$I$273,3+$A$1)","v":"0%-2%"}]
[28,"2%-5%",{"$f":"VLOOKUP(A303,Options!$A$4:$I$273,3+$A$1)","v":"2%-5%"}]
[29,"Above 5%",{"$f":"VLOOKUP(A304,Options!$A$4:$I$273,3+$A$1)","v":"über 5%"}]
[30]
[31,"Yes ",{"$f":"VLOOKUP(A306,Options!$A$4:$I$273,3+$A$1)","v":"Ja"}]
[32,"No protection",{"$f":"VLOOKUP(A307,Options!$A$4:$I$273,3+$A$1)","v":"kein Schutz"}]
[33,"No kerbs in entry/exit area",{"$f":"VLOOKUP(A308,Options!$A$4:$I$273,3+$A$1)","v":"Keine Schrammborde im Ein-/Ausfahrtsbereich"}]
[34]
[35,"Anti slip",{"$f":"VLOOKUP(A310,Options!$A$4:$I$273,3+$A$1)","v":"rutschhemmend"}]
[36,"Slippery when wet",{"$f":"VLOOKUP(A311,Options!$A$4:$I$273,3+$A$1)","v":"rutschig wenn naß"}]
[37]
[38,"< 3 m",{"$f":"VLOOKUP(A313,Options!$A$4:$I$273,3+$A$1)","v":"< 3 m"}]
[39,"3m – 3.3m",{"$f":"VLOOKUP(A314,Options!$A$4:$I$273,3+$A$1)","v":"3m - 3.3m"}]
[40,"> 3.3m",{"$f":"VLOOKUP(A315,Options!$A$4:$I$273,3+$A$1)","v":"> 3.3m"}]
[41]
[42,"Pillar does not intrude into the parking area",{"$f":"VLOOKUP(A317,Options!$A$4:$I$273,3+$A$1)","v":"Stütze beeinträchtigt den Stellplatz nicht"}]
[43,"Pillar at beginning of stall",{"$f":"VLOOKUP(A318,Options!$A$4:$I$273,3+$A$1)","v":"Stütze am Beginn des Stellplatzes"}]
[44,"Pillar next to car door",{"$f":"VLOOKUP(A319,Options!$A$4:$I$273,3+$A$1)","v":"Stütze nahe der Fahrzeugtür"}]
[45,"Pillar at back of stall but intrudes into the parking area",{"$f":"VLOOKUP(A320,Options!$A$4:$I$273,3+$A$1)","v":"Stütze am Stellplatzende aber beeinträchtigt den Stellplatz"}]
[46]
[47,"Good",{"$f":"VLOOKUP(A322,Options!$A$4:$I$273,3+$A$1)","v":"Gut"}]
[48,"Medium",{"$f":"VLOOKUP(A323,Options!$A$4:$I$273,3+$A$1)","v":"Mittel"}]
[49,"Bad",{"$f":"VLOOKUP(A324,Options!$A$4:$I$273,3+$A$1)","v":"Schlecht"}]
[50]
[51,"Angle 76°-90°",{"$f":"VLOOKUP(A326,Options!$A$4:$I$273,3+$A$1)","v":"Winkel 76°-90°"}]
[52,"Angle  45°-75°",{"$f":"VLOOKUP(A327,Options!$A$4:$I$273,3+$A$1)","v":"Winkel 45°-75°"}]
[53]
[54," 2.25 m - 2.30 m",{"$f":"VLOOKUP(A329,Options!$A$4:$I$273,3+$A$1)","v":" 2.25 m - 2.30 m"}]
[55," 2.30 m - 2.35 m",{"$f":"VLOOKUP(A330,Options!$A$4:$I$273,3+$A$1)","v":" 2.30 m - 2.35 m"}]
[56," 2.35 m - 2.40 m",{"$f":"VLOOKUP(A331,Options!$A$4:$I$273,3+$A$1)","v":" 2.35 m - 2.40 m"}]
[57," 2.40 m - 2.45 m",{"$f":"VLOOKUP(A332,Options!$A$4:$I$273,3+$A$1)","v":" 2.40 m - 2.45 m"}]
[58," 2.45 m - 2.50 m",{"$f":"VLOOKUP(A333,Options!$A$4:$I$273,3+$A$1)","v":" 2.45 m - 2.50 m"}]
[59," above 2.50 m",{"$f":"VLOOKUP(A334,Options!$A$4:$I$273,3+$A$1)","v":" über 2.50 m"}]
[60]
[61,"Compliant with the table",{"$f":"VLOOKUP(A336,Options!$A$4:$I$273,3+$A$1)","v":"(Not yet translated) Compliant with the table"}]
[62,"Up to 30 cm less",{"$f":"VLOOKUP(A337,Options!$A$4:$I$273,3+$A$1)","v":"bis zu 30 cm weniger"}]
[63,"Up to 60 cm less",{"$f":"VLOOKUP(A338,Options!$A$4:$I$273,3+$A$1)","v":"bis zu 60 cm weniger"}]
[64,"More than 60 cm less",{"$f":"VLOOKUP(A339,Options!$A$4:$I$273,3+$A$1)","v":"über 60 cm weniger"}]
[65]
[66,"Anti-Slip",{"$f":"VLOOKUP(A341,Options!$A$4:$I$273,3+$A$1)","v":"rutschhemmend"}]
[67,"Smooth",{"$f":"VLOOKUP(A342,Options!$A$4:$I$273,3+$A$1)","v":"weich"}]
[68,"No Ramps",{"$f":"VLOOKUP(A343,Options!$A$4:$I$273,3+$A$1)","v":"Keine Rampen"}]
[69]
[70,"< 2.00m",{"$f":"VLOOKUP(A345,Options!$A$4:$I$273,3+$A$1)","v":"< 2.00m"}]
[71,"2.00m – 2.10m",{"$f":"VLOOKUP(A346,Options!$A$4:$I$273,3+$A$1)","v":"2.00m – 2.10m"}]
[72,"2.10m – 2.20m",{"$f":"VLOOKUP(A347,Options!$A$4:$I$273,3+$A$1)","v":"2.10m – 2.20m"}]
[73,"> 2.20m",{"$f":"VLOOKUP(A348,Options!$A$4:$I$273,3+$A$1)","v":"> 2.20m"}]
[74]
[75,"Yes (automatic or open connection)",{"$f":"VLOOKUP(A350,Options!$A$4:$I$273,3+$A$1)","v":"Ja (automatisch oder offene Verbindung)"}]
[76,"Easy to Open",{"$f":"VLOOKUP(A351,Options!$A$4:$I$273,3+$A$1)","v":"Leicht zu öffnen"}]
[77,"No",{"$f":"VLOOKUP(A352,Options!$A$4:$I$273,3+$A$1)","v":"Nein"}]
[78]
[79,"Every pedestrian exit",{"$f":"VLOOKUP(A354,Options!$A$4:$I$273,3+$A$1)","v":"Jeder Fußgängerausgang"}]
[80,"One location",{"$f":"VLOOKUP(A355,Options!$A$4:$I$273,3+$A$1)","v":"Eine Position"}]
[81,"No",{"$f":"VLOOKUP(A356,Options!$A$4:$I$273,3+$A$1)","v":"Nein"}]
[82]
[83,"One elevator",{"$f":"VLOOKUP(A358,Options!$A$4:$I$273,3+$A$1)","v":"Ein Aufzug"}]
[84,"Two or more elevators",{"$f":"VLOOKUP(A359,Options!$A$4:$I$273,3+$A$1)","v":"Zwei oder mehr Aufzüge"}]
[85]
[86,"More Than 8 People",{"$f":"VLOOKUP(A361,Options!$A$4:$I$273,3+$A$1)","v":"Mehr als 8 Personen"}]
[87,"4 to 8 people",{"$f":"VLOOKUP(A362,Options!$A$4:$I$273,3+$A$1)","v":"4 bis 8 Personen"}]
[88,"Less Than 4",{"$f":"VLOOKUP(A363,Options!$A$4:$I$273,3+$A$1)","v":"Weniger als 4"}]
[89]
[90,"no visibility from elevator",{"$f":"VLOOKUP(A365,Options!$A$4:$I$273,3+$A$1)","v":"Keine Sicht aus dem Aufzug"}]
[91,"glazed doors/walls",{"$f":"VLOOKUP(A366,Options!$A$4:$I$273,3+$A$1)","v":"Verglaste Türen/Wände"}]
[92,"no elevator",{"$f":"VLOOKUP(A367,Options!$A$4:$I$273,3+$A$1)","v":"Kein Aufzug"}]
[93]
[94,"< 1.5 m",{"$f":"VLOOKUP(A369,Options!$A$4:$I$273,3+$A$1)","v":"< 1.5 m"}]
[95,"> 1.5 m",{"$f":"VLOOKUP(A370,Options!$A$4:$I$273,3+$A$1)","v":"> 1.5 m"}]
[96]
[97,"< 90 cm",{"$f":"VLOOKUP(A372,Options!$A$4:$I$273,3+$A$1)","v":"< 90 cm"}]
[98,">= 90 cm",{"$f":"VLOOKUP(A373,Options!$A$4:$I$273,3+$A$1)","v":">= 90 cm"}]
[99]
[100,"Glazed door/wall",{"$f":"VLOOKUP(A375,Options!$A$4:$I$273,3+$A$1)","v":"Verglaste Türen/Wände"}]
[101,"No Glass",{"$f":"VLOOKUP(A376,Options!$A$4:$I$273,3+$A$1)","v":"Kein Glas"}]
[102]
[103,"No hand rail",{"$f":"VLOOKUP(A378,Options!$A$4:$I$273,3+$A$1)","v":"Kein Handlauf"}]
[104,"One Side",{"$f":"VLOOKUP(A379,Options!$A$4:$I$273,3+$A$1)","v":"Eine Seite"}]
[105,"Two sides",{"$f":"VLOOKUP(A380,Options!$A$4:$I$273,3+$A$1)","v":"Zwei Seiten"}]
[106]
[107,"window/grilled",{"$f":"VLOOKUP(A382,Options!$A$4:$I$273,3+$A$1)","v":"Fenster/vergittert"}]
[108,"none",{"$f":"VLOOKUP(A383,Options!$A$4:$I$273,3+$A$1)","v":"Nichts"}]
[109]
[110,"24*7",{"$f":"VLOOKUP(A385,Options!$A$4:$I$273,3+$A$1)","v":"24*7"}]
[111,"All access hours if not 24*7",{"$f":"VLOOKUP(A386,Options!$A$4:$I$273,3+$A$1)","v":"Gesamte Öffnungszeit wenn nicht 24*7"}]
[112,"Part time/not available",{"$f":"VLOOKUP(A387,Options!$A$4:$I$273,3+$A$1)","v":"Teilweise/nicht verfügbar"}]
[113]
[114,"24*7",{"$f":"VLOOKUP(A389,Options!$A$4:$I$273,3+$A$1)","v":"24*7"}]
[115,"During access Hours",{"$f":"VLOOKUP(A390,Options!$A$4:$I$273,3+$A$1)","v":"Während der Öffnungszeiten"}]
[116,"Less than access Hours",{"$f":"VLOOKUP(A391,Options!$A$4:$I$273,3+$A$1)","v":"Weniger als die Öffnungszeiten"}]
[117,"No",{"$f":"VLOOKUP(A392,Options!$A$4:$I$273,3+$A$1)","v":"Nein"}]
[118]
[119,"Closed gate/rolling shutter  after access hours",{"$f":"VLOOKUP(A394,Options!$A$4:$I$273,3+$A$1)","v":"Geschlossenes Tor/Rollgitter außerhalb der Öffnungszeit"}]
[120,"Secured: fast opening gate during day",{"$f":"VLOOKUP(A395,Options!$A$4:$I$273,3+$A$1)","v":"Gesichert: Schnelllauftor tagsüber"}]
[121,"Secured: slow opening gate during day",{"$f":"VLOOKUP(A396,Options!$A$4:$I$273,3+$A$1)","v":"Gesichert: langsam öffnendes Tor tagsüber"}]
[122,"No provisions",{"$f":"VLOOKUP(A397,Options!$A$4:$I$273,3+$A$1)","v":"Keine Sicherung"}]
[123]
[124,"Maximum Aperture Door/gate/rolling shutter <= 15cm",{"$f":"VLOOKUP(A399,Options!$A$4:$I$273,3+$A$1)","v":"Größte Öffnung in Tür/Tor/Rollgitter <= 15cm"}]
[125,"Maximum Aperture Door/gate/rolling shutter > 15cm",{"$f":"VLOOKUP(A400,Options!$A$4:$I$273,3+$A$1)","v":"Größte Öffnung in Tür/Tor/Rollgitter > 15cm"}]
[126,"no provisions",{"$f":"VLOOKUP(A401,Options!$A$4:$I$273,3+$A$1)","v":"Keine Öffnung"}]
[127,"Irrelevant (24 hours opening)",{"$f":"VLOOKUP(A402,Options!$A$4:$I$273,3+$A$1)","v":"Unzutreffend (24 Stunden geöffnet)"}]
[128]
[129,"<= 15 cm",{"$f":"VLOOKUP(A404,Options!$A$4:$I$273,3+$A$1)","v":"<= 15 cm"}]
[130,">15 cm or no protection",{"$f":"VLOOKUP(A405,Options!$A$4:$I$273,3+$A$1)","v":">15 cm oder keine Sicherung"}]
[131,"Irrelevant (no external openings)",{"$f":"VLOOKUP(A406,Options!$A$4:$I$273,3+$A$1)","v":"Unzutreffend (keine Öffnungen nach außen)"}]
[132]
[133,"Yes/Good",{"$f":"VLOOKUP(A408,Options!$A$4:$I$273,3+$A$1)","v":"Ja/gut"}]
[134,"No/Bad",{"$f":"VLOOKUP(A409,Options!$A$4:$I$273,3+$A$1)","v":"Nein/schlecht"}]
[135]
[136,"Good",{"$f":"VLOOKUP(A411,Options!$A$4:$I$273,3+$A$1)","v":"Gut"}]
[137,"Adequate",{"$f":"VLOOKUP(A412,Options!$A$4:$I$273,3+$A$1)","v":"Befriedigend"}]
[138,"Poor",{"$f":"VLOOKUP(A413,Options!$A$4:$I$273,3+$A$1)","v":"Schlecht"}]
[139,"No",{"$f":"VLOOKUP(A414,Options!$A$4:$I$273,3+$A$1)","v":"Nein"}]
[140]
[141,"Clear from all locations",{"$f":"VLOOKUP(A416,Options!$A$4:$I$273,3+$A$1)","v":"Deutlich von allen Standorten"}]
[142,"Clear from most locations",{"$f":"VLOOKUP(A417,Options!$A$4:$I$273,3+$A$1)","v":"Deutlich von den meisten Standorten"}]
[143,"Clear from some locations",{"$f":"VLOOKUP(A418,Options!$A$4:$I$273,3+$A$1)","v":"Deutlich von wenigen Standorten"}]
[144,"No marking of escape routes",{"$f":"VLOOKUP(A419,Options!$A$4:$I$273,3+$A$1)","v":"Keine Kennzeichnung von Fluchtwegen"}]
[145]
[146,"Good",{"$f":"VLOOKUP(A421,Options!$A$4:$I$273,3+$A$1)","v":"Gut"}]
[147,"Adequate",{"$f":"VLOOKUP(A422,Options!$A$4:$I$273,3+$A$1)","v":"Befriedigend"}]
[148,"Poor",{"$f":"VLOOKUP(A423,Options!$A$4:$I$273,3+$A$1)","v":"Schlecht"}]
[149,"None",{"$f":"VLOOKUP(A424,Options!$A$4:$I$273,3+$A$1)","v":"Keine"}]
[150,"Single Level Car Park",{"$f":"VLOOKUP(A425,Options!$A$4:$I$273,3+$A$1)","v":"1-geschossiges Parkhaus"}]
[151]
[152,"Good",{"$f":"VLOOKUP(A427,Options!$A$4:$I$273,3+$A$1)","v":"Gut"}]
[153,"Some",{"$f":"VLOOKUP(A428,Options!$A$4:$I$273,3+$A$1)","v":"Einige"}]
[154,"None",{"$f":"VLOOKUP(A429,Options!$A$4:$I$273,3+$A$1)","v":"Keine"}]
[155]
[156,"Numbered including floor identification",{"$f":"VLOOKUP(A431,Options!$A$4:$I$273,3+$A$1)","v":"Nummeriert einschießlich Geschoßidentifizierung"}]
[157,"Just numbers",{"$f":"VLOOKUP(A432,Options!$A$4:$I$273,3+$A$1)","v":"Nur nummeriert"}]
[158,"None",{"$f":"VLOOKUP(A433,Options!$A$4:$I$273,3+$A$1)","v":"Keine"}]
[159]
[160,"0",{"$f":"VLOOKUP(A435,Options!$A$4:$I$273,3+$A$1)","v":"null"}]
[161,"1",{"$f":"VLOOKUP(A436,Options!$A$4:$I$273,3+$A$1)","v":"ein"}]
[162,"2",{"$f":"VLOOKUP(A437,Options!$A$4:$I$273,3+$A$1)","v":"zewi"}]
[163,"3 or more",{"$f":"VLOOKUP(A438,Options!$A$4:$I$273,3+$A$1)","v":"drei oder mehr"}]
[164]
[165,"One pay station",{"$f":"VLOOKUP(A440,Options!$A$4:$I$273,3+$A$1)","v":"Ein Bezahlstation"}]
[166,"More than one",{"$f":"VLOOKUP(A441,Options!$A$4:$I$273,3+$A$1)","v":"Mehr als eine"}]
[167,"One at each pedestrian entrance",{"$f":"VLOOKUP(A442,Options!$A$4:$I$273,3+$A$1)","v":"Eine an jedem Fußgängerzugang (außer reine Fluchtwege)"}]
[168,"More than one at each pedestrian entrance",{"$f":"VLOOKUP(A443,Options!$A$4:$I$273,3+$A$1)","v":"Eine an jedem Fußgängerzugang"}]
[169]
[170,"One",{"$f":"VLOOKUP(A445,Options!$A$4:$I$273,3+$A$1)","v":"Eine"}]
[171,"< 1 for every 50 spaces",{"$f":"VLOOKUP(A446,Options!$A$4:$I$273,3+$A$1)","v":"< 1 pro 50 Stellplätze"}]
[172,">1 for every 50 spaces",{"$f":"VLOOKUP(A447,Options!$A$4:$I$273,3+$A$1)","v":"> 1 pro 50 Stellplätze"}]
[173]
[174,"Unisex",{"$f":"VLOOKUP(A449,Options!$A$4:$I$273,3+$A$1)","v":"unisex"}]
[175,"Male/Female Separated",{"$f":"VLOOKUP(A450,Options!$A$4:$I$273,3+$A$1)","v":"Männer/Frauen getrennt"}]
[176]
[177,"Coloured pillars",{"$f":"VLOOKUP(A452,Options!$A$4:$I$273,3+$A$1)","v":"Farbige Stützen"}]
[178,"No/Concrete grey",{"$f":"VLOOKUP(A453,Options!$A$4:$I$273,3+$A$1)","v":"Nein/Betongrau"}]
[179]
[180,"Coloured walls",{"$f":"VLOOKUP(A455,Options!$A$4:$I$273,3+$A$1)","v":"Farbige Wände"}]
[181,"No/Concrete grey",{"$f":"VLOOKUP(A456,Options!$A$4:$I$273,3+$A$1)","v":"Nein/Betongrau"}]
[182]
[183,"More than one recharging point",{"$f":"VLOOKUP(A458,Options!$A$4:$I$273,3+$A$1)","v":"Mehr als eine Aufladestation"}]
[184,"One recharging point",{"$f":"VLOOKUP(A459,Options!$A$4:$I$273,3+$A$1)","v":"eine Aufladestation"}]
[185,"None",{"$f":"VLOOKUP(A460,Options!$A$4:$I$273,3+$A$1)","v":"keine"}]
[186]
[187,"To/from all levels",{"$f":"VLOOKUP(A462,Options!$A$4:$I$273,3+$A$1)","v":"Zu/von allen Geschossen"}]
[188,"To/from some levels",{"$f":"VLOOKUP(A463,Options!$A$4:$I$273,3+$A$1)","v":"Zu/von einigen Geschossen"}]
[189,"No Escalators or Travellator",{"$f":"VLOOKUP(A464,Options!$A$4:$I$273,3+$A$1)","v":"Keine Rolltreppen oder Rollsteige"}]
[190]
[191," <10%",{"$f":"VLOOKUP(A466,Options!$A$4:$I$273,3+$A$1)","v":" <10%"}]
[192," 10-15%",{"$f":"VLOOKUP(A467,Options!$A$4:$I$273,3+$A$1)","v":" 10-15%"}]
[193,">15%",{"$f":"VLOOKUP(A468,Options!$A$4:$I$273,3+$A$1)","v":">15%"}]
[194,"no ramps",{"$f":"VLOOKUP(A469,Options!$A$4:$I$273,3+$A$1)","v":"Keine Rampen"}]
[195]
[196,"< 3m",{"$f":"VLOOKUP(A471,Options!$A$4:$I$273,3+$A$1)","v":"< 3m"}]
[197,"3m - 3.3m",{"$f":"VLOOKUP(A472,Options!$A$4:$I$273,3+$A$1)","v":"3m - 3.3m"}]
[198,">3.3m",{"$f":"VLOOKUP(A473,Options!$A$4:$I$273,3+$A$1)","v":">3.3m"}]
[199,"no ramps",{"$f":"VLOOKUP(A474,Options!$A$4:$I$273,3+$A$1)","v":"Keine Rampen"}]
[200]
[201,"< 4m",{"$f":"VLOOKUP(A476,Options!$A$4:$I$273,3+$A$1)","v":"< 4m"}]
[202,"4m - 4.3m",{"$f":"VLOOKUP(A477,Options!$A$4:$I$273,3+$A$1)","v":"4m - 4.3m"}]
[203,">4.3m",{"$f":"VLOOKUP(A478,Options!$A$4:$I$273,3+$A$1)","v":">4.3m"}]
[204,"no ramps",{"$f":"VLOOKUP(A479,Options!$A$4:$I$273,3+$A$1)","v":"Keine Rampen"}]
[205]
[206,"< 9m",{"$f":"VLOOKUP(A481,Options!$A$4:$I$273,3+$A$1)","v":"< 9m"}]
[207,"9m – 10m",{"$f":"VLOOKUP(A482,Options!$A$4:$I$273,3+$A$1)","v":"9m – 10m"}]
[208,">10m",{"$f":"VLOOKUP(A483,Options!$A$4:$I$273,3+$A$1)","v":">10m"}]
[209,"no ramps",{"$f":"VLOOKUP(A484,Options!$A$4:$I$273,3+$A$1)","v":"Keine Rampen"}]
[210]
[211," <7.5m",{"$f":"VLOOKUP(A486,Options!$A$4:$I$273,3+$A$1)","v":" <7.5m"}]
[212,"7.5m – 9m",{"$f":"VLOOKUP(A487,Options!$A$4:$I$273,3+$A$1)","v":"7.5m – 9m"}]
[213,">9m",{"$f":"VLOOKUP(A488,Options!$A$4:$I$273,3+$A$1)","v":">9m"}]
[214,"no ramps",{"$f":"VLOOKUP(A489,Options!$A$4:$I$273,3+$A$1)","v":"Keine Rampen"}]
[215]
[216,"<5%",{"$f":"VLOOKUP(A491,Options!$A$4:$I$273,3+$A$1)","v":"<5%"}]
[217,"5% -7%",{"$f":"VLOOKUP(A492,Options!$A$4:$I$273,3+$A$1)","v":"5% -7%"}]
[218,">7%",{"$f":"VLOOKUP(A493,Options!$A$4:$I$273,3+$A$1)","v":">7%"}]
[219,"no gradient",{"$f":"VLOOKUP(A494,Options!$A$4:$I$273,3+$A$1)","v":"Kein Gefälle"}]
[220]
[221,"multi-storey open daylight",{"$f":"VLOOKUP(A496,Options!$A$4:$I$273,3+$A$1)","v":"Offenes Parkhaus mit Tageslicht"}]
[222,"multi-storey closed no daylight",{"$f":"VLOOKUP(A497,Options!$A$4:$I$273,3+$A$1)","v":"Geschlossenes Parkhaus ohne Tageslicht"}]
[223,"underground",{"$f":"VLOOKUP(A498,Options!$A$4:$I$273,3+$A$1)","v":"unterirdisch"}]
[224]
[225,"split level",{"$f":"VLOOKUP(A500,Options!$A$4:$I$273,3+$A$1)","v":"split level"}]
[226,"floors with helicons or straight ramps",{"$f":"VLOOKUP(A501,Options!$A$4:$I$273,3+$A$1)","v":"Ebenen mit gewendelten oder geraden Rampen"}]
[227,"ramped parking floors",{"$f":"VLOOKUP(A502,Options!$A$4:$I$273,3+$A$1)","v":"Ebenen mit Gefälle (Parkrampe)"}]
[228,"other",{"$f":"VLOOKUP(A503,Options!$A$4:$I$273,3+$A$1)","v":"andere"}]
[229]
[230,"barrier/gate control",{"$f":"VLOOKUP(A505,Options!$A$4:$I$273,3+$A$1)","v":"Parkhaus mit Schranke / Tor"}]
[231,"P&D control",{"$f":"VLOOKUP(A506,Options!$A$4:$I$273,3+$A$1)","v":"Parkhaus mit Parkscheinautomaten"}]
[232,"other",{"$f":"VLOOKUP(A507,Options!$A$4:$I$273,3+$A$1)","v":"andere"}]
[]
["TAB: Tags"]
[1,"Date",{"$f":"VLOOKUP(A510,Tags!$A$4:$I$273,3+$A$1)","v":"Datum"}]
[2,"Language",{"$f":"VLOOKUP(A511,Tags!$A$4:$I$273,3+$A$1)","v":"Sprache"}]
[3,"Country",{"$f":"VLOOKUP(A512,Tags!$A$4:$I$273,3+$A$1)","v":"Land"}]
[4,"Name of Car Park",{"$f":"VLOOKUP(A513,Tags!$A$4:$I$273,3+$A$1)","v":"Name des Parkhauses"}]
[5,"Address",{"$f":"VLOOKUP(A514,Tags!$A$4:$I$273,3+$A$1)","v":"Adresse"}]
[6,"City",{"$f":"VLOOKUP(A515,Tags!$A$4:$I$273,3+$A$1)","v":"Stadt"}]
[7,"Number of Spaces",{"$f":"VLOOKUP(A516,Tags!$A$4:$I$273,3+$A$1)","v":"Anzahl der Stellplätze"}]
[8,"Operator",{"$f":"VLOOKUP(A517,Tags!$A$4:$I$273,3+$A$1)","v":"Betreiber"}]
[9,"Contact Name",{"$f":"VLOOKUP(A518,Tags!$A$4:$I$273,3+$A$1)","v":"Kontaktperson"}]
[10,"e-Mail",{"$f":"VLOOKUP(A519,Tags!$A$4:$I$273,3+$A$1)","v":"e-Mail"}]
[11,"Phone",{"$f":"VLOOKUP(A520,Tags!$A$4:$I$273,3+$A$1)","v":"Telefon"}]
[12,"Judged by",{"$f":"VLOOKUP(A521,Tags!$A$4:$I$273,3+$A$1)","v":"Geprüft von"}]
[13,"Evaluation Conditions",{"$f":"VLOOKUP(A522,Tags!$A$4:$I$273,3+$A$1)","v":"Prüfbedingungen"}]
[14,"Time of Day",{"$f":"VLOOKUP(A523,Tags!$A$4:$I$273,3+$A$1)","v":"Tageszeit"}]
[15,"Weather Conditions",{"$f":"VLOOKUP(A524,Tags!$A$4:$I$273,3+$A$1)","v":"Wetterbedingungen"}]
[16,"Occupancy Rate",{"$f":"VLOOKUP(A525,Tags!$A$4:$I$273,3+$A$1)","v":"Auslastung"}]
[17,"Completed",{"$f":"VLOOKUP(A526,Tags!$A$4:$I$273,3+$A$1)","v":"vollständig"}]
[18,"Incompleted",{"$f":"VLOOKUP(A527,Tags!$A$4:$I$273,3+$A$1)","v":"unvollständig"}]
[19,"Compliant",{"$f":"VLOOKUP(A528,Tags!$A$4:$I$273,3+$A$1)","v":"übereinstimmend"}]
[20,"Comments",{"$f":"VLOOKUP(A529,Tags!$A$4:$I$273,3+$A$1)","v":"Kommentare"}]
[21,"Number of Ok:",{"$f":"VLOOKUP(A530,Tags!$A$4:$I$273,3+$A$1)","v":"Anzahl von Übereinstimmungen"}]
[22,"Number of Fails:",{"$f":"VLOOKUP(A531,Tags!$A$4:$I$273,3+$A$1)","v":"Anzahl von Mängeln"}]
[23,"Not Evaluated:",{"$f":"VLOOKUP(A532,Tags!$A$4:$I$273,3+$A$1)","v":"nicht überprüft"}]
[24,"Pass",{"$f":"VLOOKUP(A533,Tags!$A$4:$I$273,3+$A$1)","v":"bestanden"}]
[25,"Fail",{"$f":"VLOOKUP(A534,Tags!$A$4:$I$273,3+$A$1)","v":"nicht bestanden"}]
[26,"Incomplete",{"$f":"VLOOKUP(A535,Tags!$A$4:$I$273,3+$A$1)","v":"unvollständig"}]
[27,"Total Items",{"$f":"VLOOKUP(A536,Tags!$A$4:$I$273,3+$A$1)","v":"Summe der Positionen"}]
[28,"Total Items + SubItems",{"$f":"VLOOKUP(A537,Tags!$A$4:$I$273,3+$A$1)","v":"Summe der Positionen und Unterpositionen"}]
[29,"Itens Completed",{"$f":"VLOOKUP(A538,Tags!$A$4:$I$273,3+$A$1)","v":"vollständige Positionen"}]
[30,"Not measured",{"$f":"VLOOKUP(A539,Tags!$A$4:$I$273,3+$A$1)","v":"nicht gemessen"}]
[31,"Score",{"$f":"VLOOKUP(A540,Tags!$A$4:$I$273,3+$A$1)","v":"Punktzahl"}]
[32,"Maximum Score",{"$f":"VLOOKUP(A541,Tags!$A$4:$I$273,3+$A$1)","v":"Maximale Punktzahl"}]
[33,"Percentage",{"$f":"VLOOKUP(A542,Tags!$A$4:$I$273,3+$A$1)","v":"Prozentsatz"}]
[34,"Category Value",{"$f":"VLOOKUP(A543,Tags!$A$4:$I$273,3+$A$1)","v":"Wert der Kategorie"}]
[35,"Global Evaluation",{"$f":"VLOOKUP(A544,Tags!$A$4:$I$273,3+$A$1)","v":"Gesamtbewertung"}]
[36,"Category",{"$f":"VLOOKUP(A545,Tags!$A$4:$I$273,3+$A$1)","v":"Kategorie"}]
[37,"Number of Items",{"$f":"VLOOKUP(A546,Tags!$A$4:$I$273,3+$A$1)","v":"Anzahl der Positionen"}]
[38,"Number of Oks",{"$f":"VLOOKUP(A547,Tags!$A$4:$I$273,3+$A$1)","v":"Anzahl der Übereinstimmungen"}]
[39,"Number of Fails",{"$f":"VLOOKUP(A548,Tags!$A$4:$I$273,3+$A$1)","v":"Anzahl der Mängel"}]
[40,"To be Completed",{"$f":"VLOOKUP(A549,Tags!$A$4:$I$273,3+$A$1)","v":"zu vervollständigen"}]
[41,"% Obtained",{"$f":"VLOOKUP(A550,Tags!$A$4:$I$273,3+$A$1)","v":"% erreicht"}]
[42,"Minimum",{"$f":"VLOOKUP(A551,Tags!$A$4:$I$273,3+$A$1)","v":"Minimum"}]
[43,"Category Points",{"$f":"VLOOKUP(A552,Tags!$A$4:$I$273,3+$A$1)","v":"Punktzahl der Kategorie"}]
[44,"Points Obtained",{"$f":"VLOOKUP(A553,Tags!$A$4:$I$273,3+$A$1)","v":"erreichte Punktzahl"}]
[45,"Status",{"$f":"VLOOKUP(A554,Tags!$A$4:$I$273,3+$A$1)","v":"Status"}]
[46,"% Completion:",{"$f":"VLOOKUP(A555,Tags!$A$4:$I$273,3+$A$1)","v":"% Vollständigkeit"}]
[47,"Subtotals",{"$f":"VLOOKUP(A556,Tags!$A$4:$I$273,3+$A$1)","v":"Zwischensummen"}]
[48,"Totals",{"$f":"VLOOKUP(A557,Tags!$A$4:$I$273,3+$A$1)","v":"Summen"}]
[49,"Minimum Requirement for ESPA Award",{"$f":"VLOOKUP(A558,Tags!$A$4:$I$273,3+$A$1)","v":"Mindestanforderung für ESPA Award"}]
[50,"Categories Minimum Points",{"$f":"VLOOKUP(A559,Tags!$A$4:$I$273,3+$A$1)","v":"Mindestpunktzahl dieser Kategorie"}]
[51,"Espa Award",{"$f":"VLOOKUP(A560,Tags!$A$4:$I$273,3+$A$1)","v":"ESPA Award"}]
[52,"Item List",{"$f":"VLOOKUP(A561,Tags!$A$4:$I$273,3+$A$1)","v":"Positionsliste"}]
[53,"Measured value",{"$f":"VLOOKUP(A562,Tags!$A$4:$I$273,3+$A$1)","v":"Messwerte"}]
[54,"Maximum Contribuition for Final Score",{"$f":"VLOOKUP(A563,Tags!$A$4:$I$273,3+$A$1)","v":"maximaler Beitrag zum Endergebnis"}]
[55,"Contribuition for Final Score",{"$f":"VLOOKUP(A564,Tags!$A$4:$I$273,3+$A$1)","v":"Beitrag zum Endergebnis"}]
[56,"Remarks",{"$f":"VLOOKUP(A565,Tags!$A$4:$I$273,3+$A$1)","v":"Anmerkungen"}]
[57,"Notes",{"$f":"VLOOKUP(A566,Tags!$A$4:$I$273,3+$A$1)","v":"Anmerkungen"}]
[58,"This will erase all data in ESPA Worksheet. Are you sure?",{"$f":"VLOOKUP(A567,Tags!$A$4:$I$273,3+$A$1)","v":"Dies wird alle Daten in dem ESPA Arbeitsblatt löschen. Sind Sie sicher?"}]
[59,"You have entered an incorrect password. ESPA Worksheets could not be umprotected.",{"$f":"VLOOKUP(A568,Tags!$A$4:$I$273,3+$A$1)","v":"Sie haben ein unzulässiges Passwort eingegeben. Die ESPA Arbeitsblätter können nicht ungeschützt bleiben."}]
[60,"Please enter your password to umprotect ESPA Worksheet:",{"$f":"VLOOKUP(A569,Tags!$A$4:$I$273,3+$A$1)","v":"Bitte geben Sie Ihr Passwort ein um das ESPA Arbeitsblatt zu öffnen."}]
[61,"Password Input",{"$f":"VLOOKUP(A570,Tags!$A$4:$I$273,3+$A$1)","v":"Eingabe Passwort"}]
[62,"Incorrect Password",{"$f":"VLOOKUP(A571,Tags!$A$4:$I$273,3+$A$1)","v":"Unzulässiges Passwort"}]
[63,"This will print 15 pages on your active printer. Are you sure?",{"$f":"VLOOKUP(A572,Tags!$A$4:$I$273,3+$A$1)","v":"Hierdurch werden 14 Seiten auf Ihrem aktiven Drucker ausgedruckt. Sind Sie sicher?"}]
[64,"Alert",{"$f":"VLOOKUP(A573,Tags!$A$4:$I$273,3+$A$1)","v":"Alarm"}]
[65,"Changing languge will reset al your previous answers. Do you want to proceed?",{"$f":"VLOOKUP(A574,Tags!$A$4:$I$273,3+$A$1)","v":"Das Ändern der Sprache wird alle Ihre bisherigen Eingaben zurücksetzen. Sind Sie sicher?"}]
[66,"Mandatory Conditions for Golden Award",{"$f":"VLOOKUP(A575,Tags!$A$4:$I$273,3+$A$1)","v":"Mindestbedingungen für den Gold Award"}]
[67,"ESPA Gold Award",{"$f":"VLOOKUP(A576,Tags!$A$4:$I$273,3+$A$1)","v":"ESPA Gold Award"}]
[68,"Global Evaluation - Gold Award",{"$f":"VLOOKUP(A577,Tags!$A$4:$I$273,3+$A$1)","v":"Globale Bewertung - Gold Award"}]
[69,"The ESPA Worksheet uses Marcros. Please close and reopen with Macros Enabled.",{"$f":"VLOOKUP(A578,Tags!$A$4:$I$273,3+$A$1)","v":"Das ESPA Arbeitsblatt verwendet Macros. Bitte das Arbeitsblatt schließen, Macros zulassen und neu anschließend erneut öffnen."}]
[70,"Year of Construction",{"$f":"VLOOKUP(A579,Tags!$A$4:$I$273,3+$A$1)","v":"Baujahr"}]
[71,"Structure",{"$f":"VLOOKUP(A580,Tags!$A$4:$I$273,3+$A$1)","v":"Bauart"}]
[72,"Type",{"$f":"VLOOKUP(A581,Tags!$A$4:$I$273,3+$A$1)","v":"Typ"}]
[73,"Access Control System",{"$f":"VLOOKUP(A582,Tags!$A$4:$I$273,3+$A$1)","v":"Zutrittskontrolle"}]
[74,"Number of Lifts",{"$f":"VLOOKUP(A583,Tags!$A$4:$I$273,3+$A$1)","v":"Anzahl Fahrstühle"}]
[75,"Number of Floors",{"$f":"VLOOKUP(A584,Tags!$A$4:$I$273,3+$A$1)","v":"Anzahl Ebenen"}]
[76,"Car Park Main Characteristics",{"$f":"VLOOKUP(A585,Tags!$A$4:$I$273,3+$A$1)","v":"Stammdaten Einrichtung"}]

{"sheet":"Unplugged Translation Sheet","index":28,"n_rows":585,"n_cols":3,"rows_kept":585,"cut":false,"hidden":true,"merged":[]}
[4,"Translation Sheet","Deutsch"]
[]
["TAB: Languages"]
[1,"Mandatory Minimum Conditions","Mindestbedingungen"]
[2,"Car park must be for public use","Das Parkhaus muss öffentlich sein"]
[3,"Minimum headroom = 1.90 m, generally in the public areas. Incidental lower obstacles must be clearly marked.","Mindestdurchfahrtshöhe = 1.90 m im allgemein zugänglichen Bereich. Einzelne niedrigere Hindernisse müssen deutlich gekennzeichnet sein."]
[4,"Minimum headroom = 2,00 m, generally in the public areas. Incidental lower obstacles must be clearly marked.","Mindestdurchfahrtshöhe = 2,00 m im allgemein zugänglichen Bereich. Einzelne niedrigere Hindernisse müssen deutlich gekennzeichnet sein."]
[5,"There must be at least one dedicated entry and exit lane although additional tidal flow lanes are allowed.","Es müssen getrennte Ein- und Ausfahrtsspuren vorhanden sein. Tageszeitlich in wechselnder Fahrtrichtung genutzte Wechselspuren sind zulässig."]
[6,"70% of bays must be at least 2.30m wide. For renovated car parks, over ten years old, minimum bay width of 2.25m is allowed (in that case a penalty applies - check M8).","70% der Stellplätze müssen mindestens 2,30 m breit sein. Für renovierte Parkhäuser, die älter als 10 Jahre sind, wird ausnahmsweise eine Stellplatzbreite von 2,25 m toleriert. In diesem Fall kommt ein Pauschalabzug zur Anwendung (siehe M8)."]
[7,"70% of bays must be at least 2.40m wide.","70% der Stellplätze müssen mindestens 2,40 m breit sein."]
[8,"All straight ramps for  unidirectional traffic must be minimum 2.7 metres wide. Bidirectional ramps must be at least 6m wide with lane markings. Ramp width is measured between walls or pillars","Gerade Rampen mit Einrichtungsverkehr müssen mindestens 2,70 m breit sein.\nGerade Gegenverkehrsrampen müssen mindestens 6 m breit sein und eine Fahrbahnmarkierung aufweisen.\nDie Breite der Rampen wird zwischen Wänden oder Stützen gemessen.\n"]
[9,"Curved ramps for single directional traffic must have an external radius of minimum 8.00 metres with lane width of minimum 3.5 metres. For bidirectional curved ramps this applies for the inner driving lane. The outside driving lane must be minimum 3.5 metres wide as well. ","Gekrümmte Rampen mit Einrichtungsverkehr müssen einen Außenradius von mindestens 8,00 m aufweisen und die Fahrbahn muss mindestens 3,50 m breit sein. Bei gekrümmten Rampen mit Gegenverkehr gilt dasselbe für die innere Spur. Die äußere Spur muss ebenfalls mindestens 3,50 m breit sein."]
[10,"Ramp gradients must not exceed 20% , to be measured at the middle of driving lane.  At bidirectional curved ramps this applies for the inner (steepest) driving lane.","Das Gefälle von Rampen darf 20 % nicht überschreiten. Es wird in der Fahrbahnachse gemessen. Bei mehrspurigen Rampen gilt dies jeweils für die innere (steilere) Spur."]
[11,"If the car park has paid parking and access control by barriers or gates, staff must be contactable at the pay point/exit point and secured pedestrian entries.","Bei bewirtschafteten Parkhäusern mit Zugangskontrolle durch Schranken oder Tore muss das Personal an allen Bezahlstationen, Ausfahrten sowie gesicherten Fußgängerzugängen z.B. kontaktierbar sein. "]
[12,"Receipt for payment must be provided when requested.","Ein Zahlungsnachweis muss auf Verlangen herausgegeben werden."]
[13,"All turning movements must be capable of being completed without reversing (moving in/out the parking bay and cul-de-sacs excluded)","Alle Kurvenfahrten müssen ohne Zurückstoßen möglich sein (Parkierungsvorgänge und Sackgassen sind hiervon ausgenommen)."]
[14,"Average light levels on parking area at floor is at minimum 20 Lux","Die durchschnittliche Beleuchtungsstärke am Boden beträgt mindestens 20 Lux."]
[15,"Average light levels on parking area at floor is at minimum 50 Lux","Die durchschnittliche Beleuchtungsstärke am Boden beträgt mindestens 50 Lux."]
[16,"Lighting","Beleuchtung"]
[17,"Item List (values in Lux, see user manual for measurement)","Positionsliste (Werte in Lux, bezüglich der Messungen siehe Benutzungsanleitung)"]
[18,"Vehicular entry area; at floor level\n•  Above 200 Lux = 5;\n•  Between 75– 200 Lux: 0,04 pt per Lux over 75  \n•  Below 75 Lux = 0","Einfahrtsbereich, auf dem Boden\n•  über 200 Lux = 5;\n•  zwischen 75 - 200 Lux: 0,04 pt pro Lux über 75  \n•  weniger als 75 Lux = 0"]
[19,"Entry; at 1 m height near ticket-machine\n•  Above 200 Lux = 3;\n•  Between100– 200 Lux: 0,03 pt per Lux over 100\n•  Below 100 Lux = 0","Einfahrt ;  in 1 m Höhe beim Ticketgeber\n•  über 200 Lux = 3;\n•  zwischen 100 - 200 Lux: 0,03 pt pro Lux über 100\n•  weniger als 100 Lux = 0"]
[20,"Exit; at 1 m height near barrier/ticket-machine\n•  Above 200 Lux = 3;\n•  Between100– 200 Lux: 0,03 pt per Lux over 100\n•  Below 100 Lux= 0","Ausfahrt ;  in 1 m Höhe beim Ausfahrtskontrollgerät\n•  über 200 Lux = 3;\n•  zwischen 100 - 200 Lux: 0,03 pt pro Lux über 100\n•  weniger als 100 Lux= 0"]
[21,"At pay-machine; at 1 m height\n•  Above 200 Lux =4;\n•  Between100– 200 Lux: 0,04 pt per Lux over 100\n•  Below 100 Lux= 0;\n•  No Pay Machines : same as exit (enter zero if this is the case)","Kassenautomat, in 1 m Höhe (in diesem Fall bitte Null eingeben)\n•  über 200 Lux = 4;\n•  zwischen 100 - 200 Lux: 0,04 pt pro Lux über 100\n•  weniger als 100 Lux = 0;\n•  Kein Kassenautomat: wie bei Ausfahrt"]
[22,"At cashier; at counter height\n•  Above 200 Lux =4;\n•  Between100– 200 Lux: 0,04 pt per Lux over 100\n•  Below 100 Lux= 0;\n•  No cashier = 3 (enter zero if this is the case)","An der Kasse, auf Höhe des Tresens\n•  über 200 Lux = 4;\n•  zwischen 100 - 200 Lux: 0,04 pt pro Lux über 100\n•  weniger als 100 Lux = 0;\n•  Keine Kasse = 3  (in diesem Fall bitte Null eingeben)"]
[23,"In elevator; at floor level\n•  Above 70 Lux = 4;\n•  Between30– 70 Lux: 0,1 pt per Lux over 30\n•  Below 30 Lux = 0;\n•  Single level without elevator = 3 (enter zero if this is the case)","In Aufzügen, auf dem Boden\n•  über 70 Lux = 4;\n•  zwischen 30 - 70 Lux: 0,1 pt pro Lux über 30\n•  weiniger als 30 Lux = 0;\n•  eingeschossiges Parkhaus ohne Aufzug = 3  (in diesem Fall bitte Null eingeben)"]
[24,"In staircases and all other exclusive pedestrian routes; at floor level\n•  Above 90 Lux = 3;\n•  Between30– 90 Lux: 0,05 pt per Lux over 30\n•  Below 30 Lux = 0;","In Treppenhäusern und anderen ausgewiesenen Fußgängerbereichen\n•  über 90 Lux = 3;\n•  zwischen 30 - 90 Lux: 0,05 pt pro Lux über 30\n•  weniger als 30 Lux = 0;"]
[25,"Light levels on parking area at floor level: (plesase fill grid below) \nAverage light level of grid:\n•  Above 100 Lux= 10;\n•  Between20– 100 Lux: 0,125 pt per Lux over 20 \n•  Below 20 Lux= 0","Beleuchtung der Parkebenen auf dem Boden: (bitte Raster unten eintragen) \nmittlere Beleuchtungsstärke innerhalb des Rasters:\n•  über 100 Lux = 10;\n•  zwischen 20 - 100 Lux: 0,125 pt pro Lux über 20 \n•  weniger als 20 Lux= 0"]
[26,"Uniformity of light levels in grid as standard deviation\n•  Under 25% of avg light level = 10;\n•  Between25– 50%: 0,4 pt per % under 50%\n•  Above 50% =  0","Gleichmäßigkeit der Beleuchtung (Standardabweichung)\n•  weniger als 25% der mittleren Beleuchtungsstärke = 10;\n•  zwischen  25 - 50%: 0,4 pt pro % unter 50%\n•  über 50% =  0"]
[27,"Auxiliary Grid for 2.8","Hilfsraster 2.8"]
[28,"end of parking space under/between light fitting","Ende des Parkplatzes unter/zwischen Beleuchtungspunkten"]
[29,"halfway parking space under/between light fitting","Mitte des Parkplatzes unter/zwischen Beleuchtungspunkten"]
[30,"edge of driveway under/between light fitting","Fahrbahnrand unter/zwischen Beleuchtungspunkten"]
[31,"center of driveway under/between light fitting","Fahrbahnmitte unter/zwischen Beleuchtungspunkten"]
[32,"other edge of driveway under/between light fitting","Anderer Fahrbahnrand unter/zwischen Beleuchtungspunkten"]
[33,"Car Entry / Car Exit","Einfahrt / Ausfahrt"]
[34,"Car park headroom limit identified at entrance","An der Einfahrt angezeigte Durchfahrtshöhe"]
[35,"Correct sign at entrance","Ordnungsgemäßes Zeichen an der Einfahrt"]
[36,"Height barrier","Höhenbegrenzungsbalken"]
[37,"Rubber lip to prevent damage","Gummilippe am Höhenbegrenzungsbalken"]
[38,"Height:\n(The car park should receive one point for each 10cm of height above 1.90m up to 2.20 m)","Durchfahrtshöhe:\n(Das Parkhaus erhält 1 Punkt pro 10 cm Durchfahrtshöhe über 1,90 m und 2,20 m)"]
[39,"Traffic signs to define limitations in use of facility.\n• Clear signing = 3\n• Incomplete signing = 2\n• No signing = 0)","Verkehrszeichen für Nutzungsbegrenzungen\n(vollständige und eindeutige Beschilderung = 3, Beschilderung unvollständig = 2, keine Beschilderung = 0)"]
[40,"Information on:","Information bezüglich:"]
[41,"Operators terms & conditions within the car park:","Einstellbedingungen des Betreibers innerhalb des Parkhauses"]
[42,"Daily opening hours:","Öffnungszeiten"]
[43,"Scale of tariffs:","Parktarife"]
[44,"Readibility of tariff system:","Verständlichkeit der Parktarife"]
[45,"Design entry/exit area","Bauliche Ausbildung der Ein-/Ausfahrt"]
[46,"Entry ticket- machine easy to reach:","Einfahrt: Ticketgeber gut zu erreichen"]
[47,"Exit ticket- machine easy to reach:","Ausfahrt: Ausfahrtskontrollgerät gut zu erreichen"]
[48,"Longitudinal slope at the ticket machines","Längsgefälle im Bereich der Ticketgeber und Ausfahrtskontrollgeräte"]
[49,"Entry lane:\n• 0-2% (car doesn’t move without brake) = 1\n• 2-5% = 0\n• Above 5% = -1","Einfart:\n(0-2% (das Fahrzeug bleibt auch ohne Bremse stehen) = 1, 2-5% = 0, über 5% = -1)"]
[50,"Exit lane:\n• 0-2% (car doesn’t move without brake) = 1\n• 2-5% = 0\n• Above 5% = -1","Ausfahrt:\n(0-2% (das Fahrzeug bleibt auch ohne Bremse stehen) = 1, 2-5% = 0, über 5% = -1)"]
[51,"Kerb design to avoid damage to average vehicle’s wheels:\n(Yes = 2, No protection = 0, No kerbs in entry/exit area = 2)","Schrammbordausbildung zum Schutz vor Beschädigung der Reifen und Felgen:\n(ja = 2, kein Schutz = 0, keine Schrammborde im Ein-Ausfahrtsbereich = 2)\n"]
[52,"Anti slip surfaces access/egress ramps:\n(Anti slip = 1, Slippery when wet = 0)","Rutschfeste Oberfläche im Ein-/Ausfahrtsbereich:\n(rutschfest = 1, rutschig wenn nass = 0)"]
[53,"Access security","Zugangskontrolle"]
[54,"Barrier","Schranke"]
[55,"Intercom","Sprechstelle"]
[56,"CCTV","Videoüberwachung"]
[57,"Licence Plate Recognition","Kennzeichenerkennung"]
[58,"Full height fast closing gates","Schnelllauftore über die ganze Höhe"]
[59,"Staffed access(Entry or exit)","Bemannte Einfahrt/Ausfahrt"]
[60,"Entry/Exit of the building: width between structure (per lane)\n(< 3 m =0, 3 – 3.3 m =1, > 3.3 m = 2)","Durchfahrtsbreite zwischen Bauteilen im Bereich der Einfahrt/Ausfahrt\n(< 3 m =0, 3 – 3.3 m =1, > 3.3 m = 2)"]
[61,"Exit: exit slope ends at least 5 meters before crossing traffic (pedestrians/cyclists):","Ausfahrt: die Gefällestrecke endet mindestens 5 m vor dem kreuzenden Verkehr (Fußgänger/Radfahrer)."]
[62,"subtotal  car entry/exit","Zwischensumme Einfahrt/Ausfahrt"]
[63,"Parking Area","Parkebenen"]
[64,"Pillar placement for at least 85% of bays:\n• does not intrude into the parking area = 8 \n• at beginning of stall = 0\n• next to car door = 0\n• at back of stall but intrudes into the parking area = 4","Stützen im Bereich von mindestens 85 % der Stellplätze:\n(keine Beeinträchtigung des Stellplätze = 8, am Beginn der Stellplätze = 0, nahe der Fahrzeugtür = 0, am Ende aber mit Beeinträchtigung des Stellplatzes = 4)"]
[65,"Visibility (many/few dead corners, walls in the car park etc.)\nGood=4, Medium=2 or Bad=0","Übersichtlichkeit (viele/wenige tote Winkel, Wände in der Parkebene,etc.)\ngut=4, mittel=2, schlecht=0"]
[66,"Signage for car driver:","Beschilderung für den Fahrverkehr"]
[67,"Do traffic signs conform to national road code?","Sind die Verkehrszeichen konform mit den nationalen Vorschriften?"]
[68,"Routing and turn signs: Is signage clear, complete and unambiguous? ","Wegweisung: Ist die Beschilderung leicht sichtbar, vollständig und unmissverständlich?"]
[69,"Complete ?","Vollständig?"]
[70,"Easy to see ?","Leicht zu sehen?"]
[71,"Unambiguous ?","Unmissverständlich?"]
[72,"Exit signs in the car park: Is signage clear, complete and unambiguous? ","Ausfahrtsbeschilderung: Ist die Beschilderung leicht sichtbar, vollständig und unmissverständlich?"]
[73,"Complete ?","Vollständig?"]
[74,"Easy to see ?","Leicht zu sehen?"]
[75,"Unambiguous ?","Unmissverständlich?"]
[76,"Parking bay marks","Stellplatzmarkierung"]
[77,"Parking bays are clearly marked ?","Sind die Stellplätze deutlich markiert?"]
[78,"Bay markings extend up walls to assist driver ?","Sind die Markierungen bis auf die Wand verlängert um das Einparken zu erleichtern?"]
[79,"Are Road Markings:","Sind die Fahrbahnmarkierungen:"]
[80,"Complete ?","Vollständig?"]
[81,"Easy to see ?","Leicht zu sehen?"]
[82,"Unambiguous ?","Unmissverständlich?"]
[83,"Availability of spaces for disabled with wheelchair access anounced at the entrance the car park:","Wird die Verfügbarkeit von Stellplätzen für Rollstuhlfahrer an der Einfahrt angezeigt?"]
[84,"Accessible for wheelchair ?","Zugänglich für Rollstühle?"]
[85,"Bays minimum 3.5 m wide ?","Sind die Plätze mindestens 3.50 m breit?"]
[86,"Close to pedestrian exit ?","Sind sie Nahe am Ausgang?"]
[87,"Guidance to disabled spaces ?","Gibt es eine Hinweisbeschilderung zu den Stellplätzen für Behinderte?"]
[88,"Parking angle at 85 % of bays:\n(Angle 76-90° = 0, Angle  45-75° = 2)","Aufstellwinkel für 85% der Stellplätze (Winkel 76-90° = 0, Winkel  45-75° = 2)"]
[89,"Width of bays (85 % of bays), A or B: \nA: Parking angle 76 – 90 degrees\n(2.25m = -5, 2.30m = 0, 2.35m = 2, 2.40m = 4, 2.45m = 6, 2.50m = 8) \nB: Parking angle 45-75 degrees\n(2.25m = -5, 2.30m = 1, 2.35m = 3, 2.40m = 5, 2.45m = 8)\nWidth of 2.25m only applies for renovated car parks, new car parks must be minimum 2.30m","Stellplatzbreite (85 % der Stellplätze), A oder B: \nA: Aufstellwinkel zwischen 76 – 90 Grad\n(2.25m = -5, 2.30m = 0, 2.35m = 2, 2.40m = 4, 2.45m = 6, 2.50m = 8) \nB: Aufstellwinkel zwischen 45-75 degrés\n(2.25m = -5, 2.30m = 1, 2.35m = 3, 2.40m = 5, 2.45m = 8)\nDie Breite von 2.25m ist nur bei über 10 Jahre alten renovierten Parkhäusern zulässig. Neue Parkhäuser müssen eine Stellplatzbreite von mindestens 2.30m aufweisen."]
[90,"Total unit measure of one way isle width and\ndepth of two parking bays, depending on parking angle and bay width:\nBay width: 2.50m / 2.45m / 2.40m / 2.35m / 2.30m\n90° :           16.00 /  16.30 /  16.60 /  16.90 / 17.30\n85° :           15.70 /  16.00 /  16.30 /  16.60 / 16.95\n80° :           15.40 /  15.70 /  16.00 /  16.30 / 16.60\n75° :           14.95 /  15.25 /  15.55 /  15.85 / 16.15\n70° :           14.50 /  14.80 /  15.10 /  15.40 / 15.70\n65° :           14.40 /  14.40 /  14.55 /  14.80 / 15.10\n60° :           14.30 /  14.30 /  14.30 /  14.30 / 14.50\n55° :           14.00 /  14.00 /  14.00 /  14.00 / 14.10\n50° :           13.75 /  13.75 /  13.75 /  13.75 / 13.75\n45° :           13.50 /  13.50 /  13.50 /  13.50 / 13.50\n\nTotal unit measure as above qualifies for 3 points. \nUp to 30 cm less qualifies for 2 points\nUp to 60 cm less qualifies for 1 point\nMore than 60 cm less: no points given","Parkgassenbreite  (Fahrbahn plus 2 Stellplätze) in Abhängigkeit der Stellplatzbreite und des Aufstellwinkels:\nStellplatzbreite: 2.50m / 2.45m / 2.40m / 2.35m / 2.30m\n90° :                   16.00 /  16.30 /  16.60 /  16.90 / 17.30\n85° :                   15.70 /  16.00 /  16.30 /  16.60 / 16.95\n80° :                   15.40 /  15.70 /  16.00 /  16.30 / 16.60\n75° :                   14.95 /  15.25 /  15.55 /  15.85 / 16.15\n70° :                   14.50 /  14.80 /  15.10 /  15.40 / 15.70\n65° :                   14.40 /  14.40 /  14.55 /  14.80 / 15.10\n60° :                   14.30 /  14.30 /  14.30 /  14.30 / 14.50\n55° :                   14.00 /  14.00 /  14.00 /  14.00 / 14.10\n50° :                   13.75 /  13.75 /  13.75 /  13.75 / 13.75\n45° :                   13.50 /  13.50 /  13.50 /  13.50 / 13.50\n\nBreiten wie oben aufgeführt erhalten 3 Punkte. \nBreiten bis zu 30 cm weniger erhalten 2 Punkte\nBreiten bis zu 60 cm weniger erhalten 1 Punkte\nÜber 60 cm weniger: 0 Punkte\n"]
[91,"Kerb design to avoid damage to average vehicle’s wheels\n•  Yes = 2, No protection = 0","Bauliche Ausbildung der Schrammborde zum Schutz vor Beschädigungen der Reifen und Felgen:\n•  Ja = 2, kein Schutz = 0"]
[92,"Vehicle Ramps","Fahrzeugrampen"]
[93,"Is this a Single level car park without vehicular ramps or ramper floor?","Handelt es sich um ein 1-geschossiges Parkhaus ohne Rampen oder geneigte Parkebenen?"]
[94,"Ramp surface between parking areas (Anti slip 1, Smooth 0, no ramps 1)","Oberflächenausbildung der Rampe zwischen den Parkebenen (rutschhemmend 1; glatt 0, keine Rampen 1)"]
[95,"Ramp longitudinal gradient connecting ramps (not used for parking)\n•  <10%=3, 10-15%=1, >15%=0, no ramps=3","Gefälle der Geschoßverbindungsrampen (keine Parkrampen)\n•  <10%=3, 10-15%=1, >15%=0, keine Rampen=3"]
[96,"Ramp width (between kerbs) all ramps measured at narrowest point ","Rampenbreite (zwischen Schrammborden), gemessen am engsten Punkt der Rampen"]
[97,"Curved ramps must be 1 m wider for same score. Are the ramps curbed?","Gekrümmte Rampen müssen für dieselbe Punktzahl um 1m breiter sein? Sind die Rampen gekrümmt?"]
[98,"Please choose width. < 3m=0, 3-3.3m=1, >3.3m=2, no ramps=2","Breite < 3m=0, 3-3.3m=1, >3.3m=2, keine Rampen=2"]
[99,"Ramp curvature (external radius) curved ramps\n•  up to 9m=0, 9–10 m=1, >10m=2, no ramps=2\nAt dual way ramps this measure refers to the inner lane.","Rampenradius (Außenradius)\n•  bis 9m=0, 9–10 m=1, >10m=2, keine Rampen=2\nBei mehrspurigen Rampen gelten diese Angaben für die innere Spur."]
[100,"Approach curve to straight ramps\n•  <7.5m=0, 7.5–9m=1, >9m=2, no ramps=2","Eingangskurve zu geraden Rampen\n•  <7.5m=0, 7.5–9m=1, >9m=2, keine Rampen=2"]
[101,"Ramped parking floor longitudinal gradient\n•  <5%=3, 5-7 =1, >7%=0, no gradient=3","Gefälle von Parkrampen (geneigte Parkebenen)\n•  <5%=3, 5-7 =1, >7%=0, kein Gefälle =3"]
[102,"Pedestrian Access","Fußgängereingang"]
[103,"Item List","Positionsliste"]
[104,"Headroom for pedestrians - excluding doors\n• <2.00m = 0\n• 2.00m – 2.10m = 1\n• 2.10m – 2.20m = 2\n• > 2.20m = 3","Durchgangshöhe für Fußgänger (Türen ausgenommen)\n(<2.00m = 0, 2.00m – 2.10m = 1, 2.10m – 2.20m = 2, > 2.20m = 3)"]
[105,"Separate walking route (i.e. heightened; zebra stripes or colours) (yes = 2, no = 0)","Ausgewiesene Fußwege (z.B.: baulich erhöht, Zebrastreifen oder farbig) (ja = 2, nein = 0)"]
[106,"Are pedestrian entrance doors easy to use?\n(Yes, automatic or open connection = 4, Easy to open = 2, No = 0)","Sind die Türen für Fußgänger leicht zu öffnen ?\n(Ja, Automatiktüren oder offene Verbindung = 4, leicht zu öffnen = 2, nein = 0)"]
[107,"Pedestrian access controlled by ticket/pass card when car park open (Yes=1, No=0)","Ist der Fußgängereingang auch während der Öffnungszeiten mit einem Kartenleser gesichert ? (Ja=2,Nein=0)"]
[108,"City plan a central location in car park:\n(On Every pedestrian exit = 2, One location = 1, No = 0)","Liegt ein Stadtplan an einem zentralen Punkt des Parkhauses aus ?:\n(An jedem Fußgängerausgang= 2, An einer anderen Stelle = 1, Nein = 0)\n"]
[109,"Guidance:","Wegweisung:"]
[110,"to key attractions around the car park at pedestrian exit (Yes=1, No=0):","Zu wichtigen Zielen außerhalb des Parkhauses (Ja=1, Nein=0):"]
[111,"around the car park to pedestrian entrances (Yes=1, No=0):","In der Umgebung des Parkhauses zu den Eingängen (Ja=1, Nein=0):"]
[112,"Is this a Single level car park at ground floor, (not open surface) ?","Handelt es sich um ein 1-geschossiges Parkhaus auf Erdgeschoßniveau (keine offener Parkplatz)?"]
[113,"Is there elevators serving street level?","Fahren der/die Aufzüge das Erdgeschoß/Straßenniveau an?"]
[114,"Number of Elevators at street level:\n(1 elevator = 1, 2 + elevators = 5)","Anzahl der Aufzüge, welche das Erdgeschoß/Straßenniveau  anfahren:\n(1 Aufzug = 1, 2 Aufzüge oder mehr = 5)"]
[115,"Size of elevators:\n(More Than 8 people = 3, 4-8 people = 1, less than 4 = 0)","Größe der Aufzüge:\n(über 8 Personen = 3, 4-8 Personen = 1, weniger als 4 Personen= 0)"]
[116,"Visibility from elevator inside to hall/parking area\n(no visibility from elevator = 0, glazed doors/walls = 3, no elevator = 0)","Sichtverbindung zwischen Aufzug und Vorraum/Parkebene :\n(Keine Sichtverbindung = 0, Türen/Schachtwände verglast = 3, kein Aufzug = 0)"]
[117,"Level indication:","Anzeige der Etage"]
[118,"in elevator:","Im Aufzug"]
[119,"in elevator foyer:","Im Aufzugvorraum"]
[120,"Elevator control buttons at wheelchair height\n•  Yes = 1, Other = 0","Bedienelemente im Aufzug in behindertengerechter Höhe?\n•  Ja = 1, andere = 0"]
[121,"Doors directly to parking area","Verbindungstüren zu den Parkebenen"]
[122,"Width (<90 cm =0, >=90 cm = 2)","Lichte Breite (<90 cm =0, >=90 cm = 2)"]
[123,"Emergency door, standard open (Yes=2, No= 0)","Fluchttüren, standardmässig offen (ja=2, nein= 0)"]
[124,"Visibility (Glazed door/wall = 3, No Glass = 0)","Sichtbeziehung (verglaste Türen/Wände = 3, kein Glas = 0)"]
[125,"Are elevators the main vertical connection? (stairs only secondary or escape)","Sind Aufzüge die wichtigste Geschoßverbindung? (Treppen nur zweitrangig oder zur Entfluchtung)"]
[126,"Stairwells (visibility and orientation)","Treppenhäuser (Übersichtlichkeit und Orientierung)"]
[127,"Clear View (Yes = 1, No = 0, Irrelevant = 1)","Übersichtlich  (ja= 1, nein = 0, unzutreffend = 1)"]
[128,"Level Indication (Yes = 1, No = 0, Irrelevant = 1)","Geschoßkennzeichnung (ja = 1, nein = 0, unzutreffend = 1)"]
[129,"Stairs (incl. heightened visibility of steps)","Treppen (einschließlich verbesserte Sichtbarkeit von Stufen)"]
[130,"Width (< 1.5 m = 0, > 1.5m = 2)","Breite (< 1.5 m = 0, > 1.5m = 2)"]
[131,"Hand Rails (No hand rail =0, One Side = 1, Two sides=2)","Handläufe (Kein Handlauf = 0, einseitig = 1, beidseitig = 2)"]
[132,"Heightened visibility of steps for people with poor eyesight (Yes = 2, No = 0)","Verbesserte Sichtbarkeit von Stufen für Personen mit eingeschränkter Sehstärke (ja = 2, nein = 0)"]
[133,"Anti-slip surfacing on stairs: (Yes = 2, No = 0)","Rutschfester Belag auf den Stufen (ja = 2, nein = 0)"]
[134,"External openings in stairwell\n(window/grilled to outside or car park  =2, none =0)","Öffnungen in Treppenhauswänden\n(Fenster oder vergitterte Öffnungen ins Freie oder zu den Parkebenen = 2, keine Öffnungen = 0)"]
[135,"Security Equipment","Sicherheitseinrichtungen"]
[136,"Item List","Positionsliste"]
[137,"CCTV with notice at entrance = 3, No CCTV =0","Videoüberwachung mit Ankündigung am Eingang = 3, Keine Videoüberwachung = 0"]
[138,"Staff surveillance (on-site or remote)\n•  Yes = 5, No = 0","Überwachung durch Personal (vor Ort oder durch Fernüberwachung)\n•  ja = 5, nein = 0"]
[139,"CCTV at:","Videoüberwachung an besonderen Stellen"]
[140,"Car Entry: Yes =1, No =0","Einfahrt: ja = 1, nein = 0"]
[141," Car Exit: Yes =1, No =0","Ausfahrt: ja = 1, nein = 0"]
[142,"Pay Machine: Yes =1, No =0","Kassenautomat: ja = 1, nein = 0"]
[143,"Elevator Hall, every level: Yes =1, No =0","Aufzugvorraum, in allen Geschossen: ja = 1, nein = 0"]
[144,"Stairwells, every level: Yes =1, No =0","Treppenhäuser, in allen Geschossen: ja = 1, nein = 0"]
[145,"Pedestrian Entrances: Yes =1, No =0","Fußgängereingang: ja = 1, nein = 0"]
[146,"Most of Parking Area (65%):Yes =3, No =0","Überwiegender Teil der Parkebenen (65%): ja = 3, nein = 0"]
[147," Ramps: Yes = 1, No = 0","Rampen: ja = 1, nein = 0"]
[148,"Staff contactable via:","Personal kontaktierbar durch:"]
[149,"Intercom at pay machine and/or controlled entries (24/7=3, All access hours if not 24/7= 2, Part time/not available = 0)","Sprechstellen an den Kassenautomaten und/oder an den kontrollierten Zugängen (24h/7=3, während der Öffnungszeiten wenn nicht 24h/24 = 2, zeitweise oder gar nicht = 0)"]
[150,"Emergency call system in parking area (24/7=3, All access hours if not 24/7= 2, Part time/not available = 0)","Notrufmelder in den Parkebenen (24/7 = 3, während der Öffnungszeiten wenn nicht 24/7 = 2, zeitweise oder gar nicht = 0)"]
[151,"Recognizable staff present and patrolling car park\n(24/7 = 3, During access Hours = 2, Less than access Hours = 1, No = 0)","Patroullierendes Parkhauspersonal anwesend\n(24/7 = 3, während der Öffnungszeiten wenn nicht 24/7 = 1, gar nicht = 0)"]
[152,"Lockable vehicle exit/entry: \n(Closed gate/rolling shutter  after access hours = 2, Secured: fast opening gate during day = 4, Secured: slow opening gate during day = 2, No provisions = 0)","Verschließbare Ein-/Ausfahrten: \n(geschlossene Tore oder Rollgitter außerhalb der Öffnungszeiten = 2, Schnellauftore während der Öffnungszeiten = 4, langsam laufende Tore während der Öffnungszeiten = 2, keine Sicherung = 0)\n"]
[153,"Lockable pedestrian exit/entry (after opening hours).\n(Door/gate/rolling shutter <= 15cm maximum aperture = 2, over 15 cm = 0, no provisions = 0, Irrelevant (24 hours opening) = 2)","Verschließbare Ein-/Ausgänge außerhalb der Öffnungszeiten: \n(Türen, Tore oder Rollgitter mit Öffnungen <= 15 cm = 2, > 15 cm = 0, keine Sicherung = 0, unzutreffend (24 Stunden Öffnungszeit) = 2)"]
[154,"Grilles on external openings & security grilles\n(<= 15 cm = 2, > 15 cm or no protection= 0, Irrelevant (no external openings) = 2)","Vergitterung von Öffnungen nach außen\n(<= 15 cm = 2, > 15 cm oder kein Schutz= 0, unzutreffend (keine Öffnungen) = 2)"]
[155,"Wayfinding Inside and Outside","Wegweisung innerhalb und außerhalb des Parkhauses"]
[156,"Item List","Positionsliste"]
[157,"Identification of vacant parking spaces","Anzeige von freien Stellplätzen"]
[158,"Parking floor level (yes/good = 2, no/bad = 0)","Etagenweise (ja/gut = 2, nein/schlecht= 0)"]
[159,"Parking row (yes/good = 1, no/bad = 0)","Gassenweise (ja/gut = 1, nein/schlecht= 0)"]
[160,"Individual stall indication (yes/good = 2, no/bad = 0)","Platzweise (ja/gut = 2, nein/schlecht= 0)"]
[161,"Way finding (vehicles)","Wegweisung für den fahrenden Verkehr"]
[162,"Are floors clearly and separately identified for drivers? (Good =3, Adequate =2, Poor =1, No =0)","Sind die Etagen für den Fahrer klar und deutlich gekennzeichnet? (gut =3, befriedigend =2, schlecht =1, gar nicht =0)"]
[163,"Are sub-areas of floors clearly identified for drivers? (Good =3, Adequate =2, Poor =1, No =0)","Sind einzelne Bereiche für den Fahrer klar und deutlich gekennzeichnet? (gut =3, befriedigend =2, schlecht =1, gar nicht =0)"]
[164,"Are fire escapes and escape routes clearly marked\n• Clear from all locations = 3\n• most locations= 2\n• some locations=1\n• No marking of escape routes=0)","Sind die Notausgänge und Rettungswege klar und deutlich gekennzeichnet?\n(an allen Standorten = 3, an den meisten Standorten = 2, nur an einigen Standorten = 1, keine Kennzeichnung der Rettungswege = 0)"]
[165,"Are floor levels clearly marked?\n(good =3, adequate=2, poor=1, none =0. Single level car parks = 3)","Sind die einzelnen Parkebenen klar und deutlich gekennzeichnet?\n(gut = 3, befriedigend = 2, schlecht = 1, gar nicht = 0., unzutreffend, da nur 1 Geschoss = 3)"]
[166,"Is there additional signing or prompts to orient the pedestrian on the parking deck\n(good =2, some =1, none = 0)","Gibt es zusätzliche Schilder oder Anzeigen zur Verbesserung der Orientierung der Fußgänger?\n(gut = 2, einige = 1, keine = 0)"]
[167,"Are parking spaces individually numbered\n(Numbered including floor identification =2, Just numbers =1, none =0)","Sind die Stellplätze einzeln nummeriert?\n(nummeriert mit Geschoßbezeichnung = 2, nur nummeriert = 1, nicht = 0)"]
[168,"Use of colours for  way finding\n(Yes= 1, No= 0)","Verwendung von Farben zur Orientierung\n(ja = 1, nein = 0)"]
[169,"Guidance sign posting for cars on roads to car park","Parkleitsystem"]
[170,"Static sign system only (Yes = 1, No = 0)","Statisch (ja = 1, nein = 0)"]
[171,"Dynamic sign system additionally (Yes = 1, No = 0)","Dynamisch (ja = 1, nein = 0)"]
[172,"Illuminated signage at car park entrance","Beleuchtete Anzeige an der Einfahrt"]
[173,"Signal green arrow, red cross for direction (Yes = 1, No = 0)","Grüner Pfeil/rotes Kreuz-Anzeige (ja = 1, nein = 0)"]
[174,"Signal full/free (Yes = 1, No = 0)","Frei/Besetzt-Anzeige (ja = 1, nein = 0)"]
[175,"Signage at pedestrian entrance (Yes = 1, No = 0)","Anzeige an den Fußgängerzugängen (ja = 1, nein = 0)"]
[176,"Confort and Miscellaneous","Komfort und verschiedenes"]
[177,"Notice-board at pedestrian entrance/exit showing:","Hinweisschild an den Fußgängerzugängen bezüglich :"]
[178,"Access hours normal/special (yes = 1, no = 0)","Öffnungszeiten übliche/besondere (ja = 1, nein = 0)"]
[179,"Readable & understandable tariff board (yes = 1, no = 0)","Lesbare und verständliche Anzeige der Parktarife (ja = 1, nein = 0)"]
[180,"Operators terms and conditions (yes = 1, no = 0)","Einstellbedingungen (ja = 1, nein = 0)"]
[181,"Payment options (pay at exit/pay at pay station):","Bezahlmöglichkeiten (Zahlung am Ein-/Ausgang/am Kassenautomat):"]
[182,"Accepts coins? (yes =1, no =0)","Münzzahlung? (ja = 1, nein = 0)"]
[183,"Change given? (yes =1, no =0)","Wechselgeld? (ja = 1, nein = 0)"]
[184,"Accepts banknotes?  (yes =1, no =0)","Banknoten?  (ja = 1, nein = 0)"]
[185,"Accepts bank cards?  (yes =1, no =0)","Kreditkarten?  (ja = 1, nein = 0)"]
[186,"Payment by smart phone? (yes =1, no =0)","Zahlung per Mobiltelefon? (ja = 1, nein = 0)"]
[187,"Payment by card/phone at exit? (yes =1, no =0)","Karten-/Handyzahlung am Ausgang? (ja = 1, nein = 0)"]
[188,"ID & payment by LPR? (yes =1, no =0)","Identifikation und Zahlung per Kennzeichenerkennung? (ja = 1, nein = 0)"]
[189,"Accepts other cards: How many? (1 point per additional option up to 3)","Akzeptanz anderer Karten: Wie viele? (1 Punkt je zusätzlicher Option bis 3 Punkte)"]
[190,"Payment at staffed desk: (yes = 1, no = 0)","Zahlung an besetzter Kasse: (ja = 1, nein = 0)"]
[191,"Is this a Pay and Display Car Park?","Handelt es sich um ein Parkhaus ohne Schranken? (mit Parkscheinautomaten)?"]
[192,"Number of Pay points for Barrier controlled car parks:\n(One pay station = 0,  More than one =1, One at each pedestrian entrance, excluding fire escapes =2, More than one at each pedestrian entrance =3)","Anzahl der Bezahlstationen für beschrankte Parkhäuser:\n(eine = 0, mehr als eine = 1, eine an jedem Fußgängerzugang (außer Notausgänge) = 2, eine an jedem Fußgängerzugang = 3)"]
[193,"Number of Pay points for Pay and Display Car Parks\n(One =0, < 1 for every 50 spaces =2, >1 for every 50 spaces =3)","Anzahl der Parkscheinautomaten für unbeschrankte Parkhäuser:\n(einer = 0, weniger als einer pro 50 Stellplätze = 1, mehr als einer pro 50 Stellplätze = 3)"]
[194,"Customer toilets:","Öffentliche Toiletten:"]
[195,"Exist? (yes= 2, no= 0)","Vorhanden? (ja = 2, nein = 0)"]
[196,"Disabled toilet? (yes=1, no= 0)","Behindertentoilette? (ja = 1, nein = 0)"]
[197,"unisex = 0, male/female separated = 1","Toiletten unisex= 0, Frauen/Männer getrennt = 1"]
[198,"attendant: yes=1, no= 0","Toilettenaufseher(-in): ja = 1, nein = 0"]
[199,"Use of colours/ embellishing works","Verwendung von Farben / Verschönerungen"]
[200,"Coloured pillars =1, no/concrete grey = 0","Farbige Stützen = 1, nein, betongrau = 0"]
[201,"Coloured walls =1, no/concrete grey = 0","Farbige Wände = 1, nein, betongrau = 0"]
[202,"Extra embellishment","Besondere verschönernde Elemente:"]
[203," Artwork: (Yes = 2, No = 0)","Kunstwerke: (ja = 2, nein = 0)"]
[204,"Planters: (Yes = 1, No = 0)","Pflanzen: (ja = 1, nein = 0)"]
[205,"Other: (Yes = 1, No = 0)","Sonstiges: (ja = 1, nein = 0)"]
[206,"Mobile phone coverage (Yes = 2, No = 0)","Handyempfang (ja = 2, nein = 0)"]
[207,"Continuity of radio signals (Yes = 1, No = 0)","Radioemfang (ja = 1, nein = 0)"]
[208,"Music","Musik"]
[209,"Background music: yes = 2, No = 0","Hintergrundmusik:  ja = 2, nein = 0"]
[210,"Differentiation for way finding :  yes =1, No = 0","Maßnahmen zur Erleichterung der Orientierung im Parkhaus:  ja = 1, nein = 0"]
[211,"Energy and Environment","Energie und Umwelt"]
[212,"Energy Saving Lighting Systems","Energiesparende Beleuchtung"]
[213,"Power Factor Compensation (Yes=1, No=0)","Elektronische Vorschaltgeräte (EVG) (ja = 1, nein = 0)"]
[214,"Other Systems (Yes=1, No=0)","Andere Systeme (ja = 1, nein = 0)"]
[215,"Movement detection variable lights, remaining quality (yes= 2, no= 0)","Bewegungsgesteuerte Beleuchtung (ja = 2, nein = 0)"]
[216,"Adaptable lighting for daylight compensation at entrance area \n(yes= 2, no= 0)","Adaptionsstrecke an der Einfahrt.\n(ja = 2, nein = 0)"]
[217,"Adaptable lighting for ambient light conditions at parking floor from daylight\n(yes= 2, no= 0, Irrelevant (below ground) =2)","An das Tageslicht anpassbare Beleuchtung der Parkebenen (z.B. Dämmerungsschalter)\n(ja = 2, nein = 0, unzutreffend (Tiefgarage) = 2)"]
[218,"Solar panels on the roof or other green energy initiatives (yes= 2, no= 0)","Photovoltaik oder andere umweltfreundliche energetische Initiativen (ja = 2, nein = 0)"]
[219,"Special treatment of cleaning water:\n•  yes= 2, no= 0","Spezielle Behandlung von Schmutzwasser:\n•  ja = 2, nein = 0"]
[220,"Grey water or re-use of rain water\n•  yes= 2, no= 0\n","Verwendung von Regenwasser als Brauchwasser (z.B. zur Reinigung oder Toilettenspülung)\n•  ja = 2, nein = 0"]
[221,"Electric Vehicles recharging points: (Yes, more than one= 2, One recharging point=1, None=0)","Ladestationen für Elektrofahrzeuge: (ja, mehrere = 2, eine = 1, keine = 0)"]
[222,"Car sharing and similar initiatives\n•  yes= 2, no= 0","Car Sharing oder ähnliche Angebote\n•  ja = 2, nein = 0"]
[223,"Other environmental or zero emission  initiatives\n•  yes= 2, no= 0","Andere umweltfreundliche Initiativen, z.B. zur CO²-Reduzierung\n•  ja = 2, nein = 0"]
[224,"Minus Points","Minuspunkte"]
[225,"Presence of Graffiti","Vorhandensein von Graffiti in den:"]
[226,"Stairwells (Yes= -2, No= 0)","Treppenhäusern (ja = -2, nein = 0)"]
[227,"Elevator (Yes= -2, No= 0)","Aufzügen (ja = -2, nein = 0)"]
[228,"Toilets (Yes= -2, No= 0)","Toiletten (ja = -2, nein = 0)"]
[229,"Parking area (Yes= -2, No= 0)","Parkebenen (ja = -2, nein = 0)"]
[230,"Outside walls (Yes= -2, No= 0)","Außenwände (ja = -2, nein = 0)"]
[231,"Presence of dirt","Vorhandensein von Schmutz in den"]
[232,"Stairwells (Yes= -2, No= 0)","Treppenhäusern (ja = -2, nein = 0)"]
[233,"Elevator (Yes= -2, No= 0)","Aufzügen (ja = -2, nein = 0)"]
[234,"Toilets (Yes= -2, No= 0)","Toiletten (ja = -2, nein = 0)"]
[235,"Parking area (Yes= -2, No= 0)","Parkebenen (ja = -2, nein = 0)"]
[236,"Outside of entrance for pedestrians + cars (Yes= -2, No= 0)","Vor den Eingängen und Einfahrten (ja = -2, nein = 0)"]
[237,"Poor quality of paint work","Schlechte Qualität von Anstrichen in den"]
[238,"Stairwells (Yes= -2, No= 0)","Treppenhäusern (ja = -2, nein = 0)"]
[239,"Elevator (Yes= -2, No= 0)","Aufzügen (ja = -2, nein = 0)"]
[240,"Parking area (Yes= -2, No= 0)","Parkebenen (ja = -2, nein = 0)"]
[241,"Poor quality horizontal markings (Yes= -2, No= 0)","Schlechte Qualität der Bodenmarkierungen (ja = 2, nein = 0)"]
[242,"Poor quality/lack of maintenance (pot holes ,damages) ","Mangelhafte Instandhaltung (Schlaglöcher, bauliche Mängel, etc.) "]
[243,"Floors (Yes= -2, No= 0)","Boden (ja = -2, nein = 0)"]
[244,"Walls (Yes= -2, No= 0)","Wänden (ja = -2, nein = 0)"]
[245,"Evidence of standing water (Yes= -2, No= 0)","Vorhandensein von Pfützen (ja = -2, nein = 0)"]
[246,"Evidence of bad smells","Vorhandensein von üblen Gerüchen in den"]
[247,"Elevators (Yes= -2, No= 0)","Aufzügen (ja = -2, nein = 0)"]
[248,"Stairwells (Yes= -2, No= 0)","Treppenhäusern (ja = -2, nein = 0)"]
[249,"Parking deck (Yes= -2, No= 0)","Parkebenen (ja = -2, nein = 0)"]
[250,"Over 15% of parking spaces in cul-de-sac without occupancy indication. (Yes= -5, No=0)","Über 15% der Stellplätze in Sackgassen ohne Anzeige der Belegung (ja = 5, nein = 0)"]
[251,"Various points of criticism (to explain!)\n[E.g. hollow sound, squeaking tyres, unintended visitors, etc.] up to -10","Verschiedene Kritikpunkte (zu erläutern!)\n[z.B.: Lärm, quietschende Reifen, unerwünschtes Publikum, etc.] bis zu-10 Pkt."]
[252,"Penalty for Mandatory Condition 1.4 Applies","Strafabzug für Mindestanforderung 1.4 kommt zur Anwendung."]
[253,"Bonus Points","Bonuspunkte"]
[254,"Extra provisions in car park","Zusätzliche Einrichtungen im Parkhaus:"]
[255,"Special motorcycle area (Yes= 1, No= 0)","Motorradstellplätze (ja = 1, nein = 0)"]
[256,"Lockers for customers’ use (Yes= 1, No= 0)","Schließfächer (ja = 1, nein = 0)"]
[257,"Other aids (Yes= 1, No= 0)","Andere Angebote (ja = 1, nein = 0)"]
[258,"Bicycle rent (Yes= 1, No= 0)","Fahrradverleih (ja = 1, nein = 0)"]
[259,"Other Driver Assistance (Yes= 1, No= 0)","Andere Fahrerservices (ja = 1, nein = 0)"]
[260,"Vending Machines (Yes= 1, No= 0)","Verkaufsautomaten (ja = 1, nein = 0)"]
[261,"Heart Defibrillator (Yes= 1, No= 0)","Defibrillator (ja = 1, nein = 0)"]
[262,"First aid trained staff (Yes= 1, No= 0)","Personal mit Erste-Hilfe-Ausbildung (ja = 1, nein = 0)"]
[263,"Real time traffic data (Yes= 1, No= 0)","Echtzeit-Verkehrsinformationen (ja = 1, nein = 0)"]
[264,"Other real time accessible information (e.g. local events) (Yes= 1, No= 0)","Andere aktuelle Informationen  (z.B. lokale Veranstaltungen) (ja = 1, nein = 0)"]
[265,"Measures to avoid traffic queues at peak hours (i.e. tidal lane at car entry/exit) - (Yes= 3, No= 0)","Maßnahmen zur Verbesserung des Verkehrsablaufes in Spitzenstunden (z.B. tageszeitlich wechselnde Ein-/Ausfahrtsspuren) - (ja = 3, nein = 0)"]
[266,"Turn around possibility for cars before height barrier or full sign to prevent reversing (Yes= 3, No= 0)","Wendemöglichkeit für Fahrzeuge vor der Höhenbegrenzung oder besondere Anzeigen zur Vermeidung von Rückwärtsfahrten  (ja = 3, nein = 0)"]
[267,"Customer service desk (Yes= 1, No= 0)","Parkhausaufsicht mit Bedientresen (ja = 1, nein = 0)"]
[268,"Escalators and/or travellators\n(To/from all levels =5, To/from some levels =3, No Escalators or Travellators = 0)","Rolltreppen oder Rollsteige\n(von/zu allen Etagen = 5, nur zu bestimmten Etagen = 3, keine Rolltreppen oder Rollsteige = 0)"]
[269,"Localisation of parked cars by ticket or license plate\n(Yes= 1, No= 0)","Lokalisierung von Fahrzeugen durch den Parkschein oder das Fahrzeugkennzeichen\n(ja = 1, nein = 0)"]
[270,"Other positive points e.g. extra services, friendly staff, tiled walls/floors, good fit of the car park in cityscape etc up to ten additional bonus points. To be explicitly identified.","Andere positive Punkte oder Zusatzleistungen, wie freundliches Personal, gekachelte Wände/Böden, gutes Einfügen des Parkhauses in das Stadtbild usw. (zu beschreiben). (bis zu 10 Punkte)."]
[]
["TAB: Options"]
[1,"Morning","Morgen"]
[2,"Afternoon","Nachmittag"]
[3,"Evening","Abend"]
[4]
[5,"Sunny","sonnig"]
[6,"Cloudy","bewölkt"]
[7,"Rain","Regen"]
[8,"Dusk","Dämmerung"]
[9,"Night","Nacht"]
[10]
[11," > 75%"," > 75%"]
[12," 50% - 75%"," 50% - 75%"]
[13," about 50%","etwa 50%"]
[14," 25% - 50%  "," 25% - 50%"]
[15,"< 25%","< 25%"]
[16]
[17,"OK","OK"]
[18,"Fail","Mangel"]
[19]
[20,"Yes","Ja"]
[21,"No","Nein"]
[22,"Irrelevant","unzutreffend"]
[23,"Clear signing","verständliche Beschilderung"]
[24,"Incomplete signing","unvollständige Beschilderung"]
[25,"No signing","keine Beschilderung"]
[26]
[27,"0%-2%","0%-2%"]
[28,"2%-5%","2%-5%"]
[29,"Above 5%","über 5%"]
[30]
[31,"Yes ","Ja"]
[32,"No protection","kein Schutz"]
[33,"No kerbs in entry/exit area","Keine Schrammborde im Ein-/Ausfahrtsbereich"]
[34]
[35,"Anti slip","rutschhemmend"]
[36,"Slippery when wet","rutschig wenn naß"]
[37]
[38,"< 3 m","< 3 m"]
[39,"3m – 3.3m","3m - 3.3m"]
[40,"> 3.3m","> 3.3m"]
[41]
[42,"Pillar does not intrude into the parking area","Stütze beeinträchtigt den Stellplatz nicht"]
[43,"Pillar at beginning of stall","Stütze am Beginn des Stellplatzes"]
[44,"Pillar next to car door","Stütze nahe der Fahrzeugtür"]
[45,"Pillar at back of stall but intrudes into the parking area","Stütze am Stellplatzende aber beeinträchtigt den Stellplatz"]
[46]
[47,"Good","Gut"]
[48,"Medium","Mittel"]
[49,"Bad","Schlecht"]
[50]
[51,"Angle 76°-90°","Winkel 76°-90°"]
[52,"Angle  45°-75°","Winkel 45°-75°"]
[53]
[54," 2.25 m - 2.30 m"," 2.25 m - 2.30 m"]
[55," 2.30 m - 2.35 m"," 2.30 m - 2.35 m"]
[56," 2.35 m - 2.40 m"," 2.35 m - 2.40 m"]
[57," 2.40 m - 2.45 m"," 2.40 m - 2.45 m"]
[58," 2.45 m - 2.50 m"," 2.45 m - 2.50 m"]
[59," above 2.50 m"," über 2.50 m"]
[60]
[61,"Compliant with the table","(Not yet translated) Compliant with the table"]
[62,"Up to 30 cm less","bis zu 30 cm weniger"]
[63,"Up to 60 cm less","bis zu 60 cm weniger"]
[64,"More than 60 cm less","über 60 cm weniger"]
[65]
[66,"Anti-Slip","rutschhemmend"]
[67,"Smooth","weich"]
[68,"No Ramps","Keine Rampen"]
[69]
[70,"< 2.00m","< 2.00m"]
[71,"2.00m – 2.10m","2.00m – 2.10m"]
[72,"2.10m – 2.20m","2.10m – 2.20m"]
[73,"> 2.20m","> 2.20m"]
[74]
[75,"Yes (automatic or open connection)","Ja (automatisch oder offene Verbindung)"]
[76,"Easy to Open","Leicht zu öffnen"]
[77,"No","Nein"]
[78]
[79,"Every pedestrian exit","Jeder Fußgängerausgang"]
[80,"One location","Eine Position"]
[81,"No","Nein"]
[82]
[83,"One elevator","Ein Aufzug"]
[84,"Two or more elevators","Zwei oder mehr Aufzüge"]
[85]
[86,"More Than 8 People","Mehr als 8 Personen"]
[87,"4 to 8 people","4 bis 8 Personen"]
[88,"Less Than 4","Weniger als 4"]
[89]
[90,"no visibility from elevator","Keine Sicht aus dem Aufzug"]
[91,"glazed doors/walls","Verglaste Türen/Wände"]
[92,"no elevator","Kein Aufzug"]
[93]
[94,"< 1.5 m","< 1.5 m"]
[95,"> 1.5 m","> 1.5 m"]
[96]
[97,"< 90 cm","< 90 cm"]
[98,">= 90 cm",">= 90 cm"]
[99]
[100,"Glazed door/wall","Verglaste Türen/Wände"]
[101,"No Glass","Kein Glas"]
[102]
[103,"No hand rail","Kein Handlauf"]
[104,"One Side","Eine Seite"]
[105,"Two sides","Zwei Seiten"]
[106]
[107,"window/grilled","Fenster/vergittert"]
[108,"none","Nichts"]
[109]
[110,"24*7","24*7"]
[111,"All access hours if not 24*7","Gesamte Öffnungszeit wenn nicht 24*7"]
[112,"Part time/not available","Teilweise/nicht verfügbar"]
[113]
[114,"24*7","24*7"]
[115,"During access Hours","Während der Öffnungszeiten"]
[116,"Less than access Hours","Weniger als die Öffnungszeiten"]
[117,"No","Nein"]
[118]
[119,"Closed gate/rolling shutter  after access hours","Geschlossenes Tor/Rollgitter außerhalb der Öffnungszeit"]
[120,"Secured: fast opening gate during day","Gesichert: Schnelllauftor tagsüber"]
[121,"Secured: slow opening gate during day","Gesichert: langsam öffnendes Tor tagsüber"]
[122,"No provisions","Keine Sicherung"]
[123]
[124,"Maximum Aperture Door/gate/rolling shutter <= 15cm","Größte Öffnung in Tür/Tor/Rollgitter <= 15cm"]
[125,"Maximum Aperture Door/gate/rolling shutter > 15cm","Größte Öffnung in Tür/Tor/Rollgitter > 15cm"]
[126,"no provisions","Keine Öffnung"]
[127,"Irrelevant (24 hours opening)","Unzutreffend (24 Stunden geöffnet)"]
[128]
[129,"<= 15 cm","<= 15 cm"]
[130,">15 cm or no protection",">15 cm oder keine Sicherung"]
[131,"Irrelevant (no external openings)","Unzutreffend (keine Öffnungen nach außen)"]
[132]
[133,"Yes/Good","Ja/gut"]
[134,"No/Bad","Nein/schlecht"]
[135]
[136,"Good","Gut"]
[137,"Adequate","Befriedigend"]
[138,"Poor","Schlecht"]
[139,"No","Nein"]
[140]
[141,"Clear from all locations","Deutlich von allen Standorten"]
[142,"Clear from most locations","Deutlich von den meisten Standorten"]
[143,"Clear from some locations","Deutlich von wenigen Standorten"]
[144,"No marking of escape routes","Keine Kennzeichnung von Fluchtwegen"]
[145]
[146,"Good","Gut"]
[147,"Adequate","Befriedigend"]
[148,"Poor","Schlecht"]
[149,"None","Keine"]
[150,"Single Level Car Park","1-geschossiges Parkhaus"]
[151]
[152,"Good","Gut"]
[153,"Some","Einige"]
[154,"None","Keine"]
[155]
[156,"Numbered including floor identification","Nummeriert einschießlich Geschoßidentifizierung"]
[157,"Just numbers","Nur nummeriert"]
[158,"None","Keine"]
[159]
[160,"0","null"]
[161,"1","ein"]
[162,"2","zewi"]
[163,"3 or more","drei oder mehr"]
[164]
[165,"One pay station","Ein Bezahlstation"]
[166,"More than one","Mehr als eine"]
[167,"One at each pedestrian entrance","Eine an jedem Fußgängerzugang (außer reine Fluchtwege)"]
[168,"More than one at each pedestrian entrance","Eine an jedem Fußgängerzugang"]
[169]
[170,"One","Eine"]
[171,"< 1 for every 50 spaces","< 1 pro 50 Stellplätze"]
[172,">1 for every 50 spaces","> 1 pro 50 Stellplätze"]
[173]
[174,"Unisex","unisex"]
[175,"Male/Female Separated","Männer/Frauen getrennt"]
[176]
[177,"Coloured pillars","Farbige Stützen"]
[178,"No/Concrete grey","Nein/Betongrau"]
[179]
[180,"Coloured walls","Farbige Wände"]
[181,"No/Concrete grey","Nein/Betongrau"]
[182]
[183,"More than one recharging point","Mehr als eine Aufladestation"]
[184,"One recharging point","eine Aufladestation"]
[185,"None","keine"]
[186]
[187,"To/from all levels","Zu/von allen Geschossen"]
[188,"To/from some levels","Zu/von einigen Geschossen"]
[189,"No Escalators or Travellator","Keine Rolltreppen oder Rollsteige"]
[190]
[191," <10%"," <10%"]
[192," 10-15%"," 10-15%"]
[193,">15%",">15%"]
[194,"no ramps","Keine Rampen"]
[195]
[196,"< 3m","< 3m"]
[197,"3m - 3.3m","3m - 3.3m"]
[198,">3.3m",">3.3m"]
[199,"no ramps","Keine Rampen"]
[200]
[201,"< 4m","< 4m"]
[202,"4m - 4.3m","4m - 4.3m"]
[203,">4.3m",">4.3m"]
[204,"no ramps","Keine Rampen"]
[205]
[206,"< 9m","< 9m"]
[207,"9m – 10m","9m – 10m"]
[208,">10m",">10m"]
[209,"no ramps","Keine Rampen"]
[210]
[211," <7.5m"," <7.5m"]
[212,"7.5m – 9m","7.5m – 9m"]
[213,">9m",">9m"]
[214,"no ramps","Keine Rampen"]
[215]
[216,"<5%","<5%"]
[217,"5% -7%","5% -7%"]
[218,">7%",">7%"]
[219,"no gradient","Kein Gefälle"]
[220]
[221,"multi-storey open daylight","Offenes Parkhaus mit Tageslicht"]
[222,"multi-storey closed no daylight","Geschlossenes Parkhaus ohne Tageslicht"]
[223,"underground","unterirdisch"]
[224]
[225,"split level","split level"]
[226,"floors with helicons or straight ramps","Ebenen mit gewendelten oder geraden Rampen"]
[227,"ramped parking floors","Ebenen mit Gefälle (Parkrampe)"]
[228,"other","andere"]
[229]
[230,"barrier/gate control","Parkhaus mit Schranke / Tor"]
[231,"P&D control","Parkhaus mit Parkscheinautomaten"]
[232,"other","andere"]
[]
["TAB: Tags"]
[1,"Date","Datum"]
[2,"Language","Sprache"]
[3,"Country","Land"]
[4,"Name of Car Park","Name des Parkhauses"]
[5,"Address","Adresse"]
[6,"City","Stadt"]
[7,"Number of Spaces","Anzahl der Stellplätze"]
[8,"Operator","Betreiber"]
[9,"Contact Name","Kontaktperson"]
[10,"e-Mail","e-Mail"]
[11,"Phone","Telefon"]
[12,"Judged by","Geprüft von"]
[13,"Evaluation Conditions","Prüfbedingungen"]
[14,"Time of Day","Tageszeit"]
[15,"Weather Conditions","Wetterbedingungen"]
[16,"Occupancy Rate","Auslastung"]
[17,"Completed","vollständig"]
[18,"Incompleted","unvollständig"]
[19,"Compliant","übereinstimmend"]
[20,"Comments","Kommentare"]
[21,"Number of Ok:","Anzahl von Übereinstimmungen"]
[22,"Number of Fails:","Anzahl von Mängeln"]
[23,"Not Evaluated:","nicht überprüft"]
[24,"Pass","bestanden"]
[25,"Fail","nicht bestanden"]
[26,"Incomplete","unvollständig"]
[27,"Total Items","Summe der Positionen"]
[28,"Total Items + SubItems","Summe der Positionen und Unterpositionen"]
[29,"Itens Completed","vollständige Positionen"]
[30,"Not measured","nicht gemessen"]
[31,"Score","Punktzahl"]
[32,"Maximum Score","Maximale Punktzahl"]
[33,"Percentage","Prozentsatz"]
[34,"Category Value","Wert der Kategorie"]
[35,"Global Evaluation","Gesamtbewertung"]
[36,"Category","Kategorie"]
[37,"Number of Items","Anzahl der Positionen"]
[38,"Number of Oks","Anzahl der Übereinstimmungen"]
[39,"Number of Fails","Anzahl der Mängel"]
[40,"To be Completed","zu vervollständigen"]
[41,"% Obtained","% erreicht"]
[42,"Minimum","Minimum"]
[43,"Category Points","Punktzahl der Kategorie"]
[44,"Points Obtained","erreichte Punktzahl"]
[45,"Status","Status"]
[46,"% Completion:","% Vollständigkeit"]
[47,"Subtotals","Zwischensummen"]
[48,"Totals","Summen"]
[49,"Minimum Requirement for ESPA Award","Mindestanforderung für ESPA Award"]
[50,"Categories Minimum Points","Mindestpunktzahl dieser Kategorie"]
[51,"Espa Award","ESPA Award"]
[52,"Item List","Positionsliste"]
[53,"Measured value","Messwerte"]
[54,"Maximum Contribuition for Final Score","maximaler Beitrag zum Endergebnis"]
[55,"Contribuition for Final Score","Beitrag zum Endergebnis"]
[56,"Remarks","Anmerkungen"]
[57,"Notes","Anmerkungen"]
[58,"This will erase all data in ESPA Worksheet. Are you sure?","Dies wird alle Daten in dem ESPA Arbeitsblatt löschen. Sind Sie sicher?"]
[59,"You have entered an incorrect password. ESPA Worksheets could not be umprotected.","Sie haben ein unzulässiges Passwort eingegeben. Die ESPA Arbeitsblätter können nicht ungeschützt bleiben."]
[60,"Please enter your password to umprotect ESPA Worksheet:","Bitte geben Sie Ihr Passwort ein um das ESPA Arbeitsblatt zu öffnen."]
[61,"Password Input","Eingabe Passwort"]
[62,"Incorrect Password","Unzulässiges Passwort"]
[63,"This will print 15 pages on your active printer. Are you sure?","Hierdurch werden 14 Seiten auf Ihrem aktiven Drucker ausgedruckt. Sind Sie sicher?"]
[64,"Alert","Alarm"]
[65,"Changing languge will reset al your previous answers. Do you want to proceed?","Das Ändern der Sprache wird alle Ihre bisherigen Eingaben zurücksetzen. Sind Sie sicher?"]
[66,"Mandatory Conditions for Golden Award","Mindestbedingungen für den Gold Award"]
[67,"ESPA Gold Award","ESPA Gold Award"]
[68,"Global Evaluation - Gold Award","Globale Bewertung - Gold Award"]
[69,"The ESPA Worksheet uses Marcros. Please close and reopen with Macros Enabled.","Das ESPA Arbeitsblatt verwendet Macros. Bitte das Arbeitsblatt schließen, Macros zulassen und neu anschließend erneut öffnen."]
[70,"Year of Construction",0]
[71,"Structure",0]
[72,"Type",0]
[73,"Access Control System",0]
[74,"Number of Lifts",0]
[75,"Number of Floors",0]
[76,"Car Park Main Characteristics",0]